Build #509 for commit da20091d from wip-suse-master
 failed 61 minutes 36 seconds
gitlab-ci-multi-runner 1.0.4 (014aa8c)
Using Shell executor...
Running on ceph-workbench.dachary.org...
Fetching changes...
Removing .cache/
Removing .coverage
Removing .tox/
Removing ceph_workbench.egg-info/
Removing ceph_workbench/__init__.pyc
Removing ceph_workbench/ceph_qa_suite.pyc
Removing ceph_workbench/delegate.pyc
Removing ceph_workbench/main.pyc
Removing ceph_workbench/release.pyc
Removing ceph_workbench/util.pyc
Removing ceph_workbench/wbbackport.pyc
Removing ceph_workbench/wbbackportcreateissue.pyc
Removing ceph_workbench/wbbackportsetrelease.pyc
Removing ceph_workbench/wbgit.pyc
Removing ceph_workbench/wbgithub.pyc
Removing ceph_workbench/wbgitlab.pyc
Removing ceph_workbench/wbredmine.pyc
Removing ceph_workbench/wbxref.pyc
Removing tests/__pycache__/
Removing tests/fixture_git.pyc
Removing tests/fixture_github.pyc
Removing tests/fixture_gitlab.pyc
Removing tests/fixture_redmine.pyc
Removing tests/fixture_xref.pyc
Removing virtualenv/
HEAD is now at 9f6e2b2 bump 1.5.15
From http://ceph-workbench.dachary.org/root/ceph-workbench
 * [new branch]      wip-suse-master -> origin/wip-suse-master
Fetching submodule teuthology
From http://github.com/SUSE/teuthology
   d18aef5d..d17dc208  master              -> origin/master
 * [new branch]        master-old          -> origin/master-old
 * [new branch]        wip-buildpackages-2 -> origin/wip-buildpackages-2
Checking out da20091d as wip-suse-master...
Previous HEAD position was 9f6e2b2... bump 1.5.15
HEAD is now at da20091... teuthology: update to latest wip-buildpackages-2
M	teuthology
$ bash -x run-tests.sh
+ set -ex
+ trap 'bash tests/teardown.sh' EXIT
+ source bootstrap
++ sudo apt-get install -y software-properties-common
Reading package lists...
Building dependency tree...
Reading state information...
software-properties-common is already the newest version.
0 upgraded, 0 newly installed, 0 to remove and 181 not upgraded.
++ sudo add-apt-repository --yes ppa:git-core/ppa
gpg: keyring `/tmp/tmpymfdttlh/secring.gpg' created
gpg: keyring `/tmp/tmpymfdttlh/pubring.gpg' created
gpg: requesting key E1DF1F24 from hkp server keyserver.ubuntu.com
gpg: /tmp/tmpymfdttlh/trustdb.gpg: trustdb created
gpg: key E1DF1F24: public key "Launchpad PPA for Ubuntu Git Maintainers" imported
gpg: Total number processed: 1
gpg:               imported: 1  (RSA: 1)
OK
++ sudo apt-get update
Hit http://ppa.launchpad.net trusty InRelease
Get:1 http://security.ubuntu.com trusty-security InRelease [65.9 kB]
Hit http://ppa.launchpad.net trusty/main amd64 Packages
Hit http://ppa.launchpad.net trusty/main Translation-en
Get:2 http://security.ubuntu.com trusty-security/main Sources [124 kB]
Hit https://apt.dockerproject.org ubuntu-trusty InRelease
Hit https://apt.dockerproject.org ubuntu-trusty/main amd64 Packages
Get:3 https://apt.dockerproject.org ubuntu-trusty/main Translation-en_US
Get:4 http://security.ubuntu.com trusty-security/universe Sources [49.3 kB]
Get:5 http://security.ubuntu.com trusty-security/main amd64 Packages [579 kB]
Hit https://packages.gitlab.com trusty InRelease
Hit https://packages.gitlab.com trusty/main Sources
Ign https://apt.dockerproject.org ubuntu-trusty/main Translation-en_US
Hit https://packages.gitlab.com trusty/main amd64 Packages
Ign https://apt.dockerproject.org ubuntu-trusty/main Translation-en
Get:6 http://security.ubuntu.com trusty-security/universe amd64 Packages [151 kB]
Get:7 https://packages.gitlab.com trusty/main Translation-en_US
Get:8 http://security.ubuntu.com trusty-security/main Translation-en [320 kB]
Ign https://packages.gitlab.com trusty/main Translation-en_US
Ign https://packages.gitlab.com trusty/main Translation-en
Get:9 http://security.ubuntu.com trusty-security/universe Translation-en [88.7 kB]
Ign http://nova.clouds.archive.ubuntu.com trusty InRelease
Get:10 http://nova.clouds.archive.ubuntu.com trusty-updates InRelease [65.9 kB]
Hit http://nova.clouds.archive.ubuntu.com trusty Release.gpg
Get:11 http://nova.clouds.archive.ubuntu.com trusty-updates/main Sources [391 kB]
Get:12 http://nova.clouds.archive.ubuntu.com trusty-updates/universe Sources [173 kB]
Get:13 http://nova.clouds.archive.ubuntu.com trusty-updates/main amd64 Packages [947 kB]
Get:14 http://nova.clouds.archive.ubuntu.com trusty-updates/universe amd64 Packages [397 kB]
Get:15 http://nova.clouds.archive.ubuntu.com trusty-updates/main Translation-en [467 kB]
Get:16 http://nova.clouds.archive.ubuntu.com trusty-updates/universe Translation-en [210 kB]
Hit http://nova.clouds.archive.ubuntu.com trusty Release
Hit http://nova.clouds.archive.ubuntu.com trusty/main Sources
Hit http://nova.clouds.archive.ubuntu.com trusty/universe Sources
Hit http://nova.clouds.archive.ubuntu.com trusty/main amd64 Packages
Hit http://nova.clouds.archive.ubuntu.com trusty/universe amd64 Packages
Hit http://nova.clouds.archive.ubuntu.com trusty/main Translation-en
Hit http://nova.clouds.archive.ubuntu.com trusty/universe Translation-en
Ign http://nova.clouds.archive.ubuntu.com trusty/main Translation-en_US
Ign http://nova.clouds.archive.ubuntu.com trusty/universe Translation-en_US
Fetched 4,029 kB in 8s (496 kB/s)
Reading package lists...
++ sudo apt-get install -y git
Reading package lists...
Building dependency tree...
Reading state information...
git is already the newest version.
0 upgraded, 0 newly installed, 0 to remove and 181 not upgraded.
++ git submodule sync
Synchronizing submodule url for 'teuthology'
++ git submodule update --force --init --recursive
Submodule path 'teuthology': checked out 'd2154556e286d722ff4fd9b2f7952082bf0f4f56'
++ cd teuthology
++ git clean -ffqdx
++ ./bootstrap install
New python executable in virtualenv/bin/python
Installing setuptools, pip...done.
Downloading/unpacking pip from https://pypi.python.org/packages/b6/ac/7015eb97dc749283ffdec1c3a88ddb8ae03b8fad0f0e611408f196358da3/pip-9.0.1-py2.py3-none-any.whl#md5=297dbd16ef53bcef0447d245815f5144
Installing collected packages: pip
  Found existing installation: pip 1.5.4
    Uninstalling pip:
      Successfully uninstalled pip
Successfully installed pip
Cleaning up...
/home/gitlab-runner/builds/9120dac4/0/root/ceph-workbench/teuthology/virtualenv/local/lib/python2.7/site-packages/pip/_vendor/requests/packages/urllib3/util/ssl_.py:318: SNIMissingWarning: An HTTPS request has been made, but the SNI (Subject Name Indication) extension to TLS is not available on this platform. This may cause the server to present an incorrect TLS certificate, which can cause validation failures. You can upgrade to a newer version of Python to solve this. For more information, see https://urllib3.readthedocs.io/en/latest/security.html#snimissingwarning.
  SNIMissingWarning
/home/gitlab-runner/builds/9120dac4/0/root/ceph-workbench/teuthology/virtualenv/local/lib/python2.7/site-packages/pip/_vendor/requests/packages/urllib3/util/ssl_.py:122: InsecurePlatformWarning: A true SSLContext object is not available. This prevents urllib3 from configuring SSL appropriately and may cause certain SSL connections to fail. You can upgrade to a newer version of Python to solve this. For more information, see https://urllib3.readthedocs.io/en/latest/security.html#insecureplatformwarning.
  InsecurePlatformWarning
Collecting setuptools
  Using cached setuptools-34.1.1-py2.py3-none-any.whl
Collecting packaging>=16.8 (from setuptools)
  Using cached packaging-16.8-py2.py3-none-any.whl
Collecting appdirs>=1.4.0 (from setuptools)
  Using cached appdirs-1.4.0-py2.py3-none-any.whl
Collecting six>=1.6.0 (from setuptools)
  Using cached six-1.10.0-py2.py3-none-any.whl
Collecting pyparsing (from packaging>=16.8->setuptools)
  Using cached pyparsing-2.1.10-py2.py3-none-any.whl
Installing collected packages: six, pyparsing, packaging, appdirs, setuptools
  Found existing installation: setuptools 2.2
    Uninstalling setuptools-2.2:
      Successfully uninstalled setuptools-2.2
Successfully installed appdirs-1.4.0 packaging-16.8 pyparsing-2.1.10 setuptools-34.1.1 six-1.10.0
/home/gitlab-runner/builds/9120dac4/0/root/ceph-workbench/teuthology/virtualenv/local/lib/python2.7/site-packages/pip/_vendor/requests/packages/urllib3/util/ssl_.py:122: InsecurePlatformWarning: A true SSLContext object is not available. This prevents urllib3 from configuring SSL appropriately and may cause certain SSL connections to fail. You can upgrade to a newer version of Python to solve this. For more information, see https://urllib3.readthedocs.io/en/latest/security.html#insecureplatformwarning.
  InsecurePlatformWarning
Obtaining file:///home/gitlab-runner/builds/9120dac4/0/root/ceph-workbench/teuthology (from -r requirements.txt (line 3))
Collecting boto==2.39.0 (from -r requirements.txt (line 5))
/home/gitlab-runner/builds/9120dac4/0/root/ceph-workbench/teuthology/virtualenv/local/lib/python2.7/site-packages/pip/_vendor/requests/packages/urllib3/util/ssl_.py:318: SNIMissingWarning: An HTTPS request has been made, but the SNI (Subject Name Indication) extension to TLS is not available on this platform. This may cause the server to present an incorrect TLS certificate, which can cause validation failures. You can upgrade to a newer version of Python to solve this. For more information, see https://urllib3.readthedocs.io/en/latest/security.html#snimissingwarning.
  SNIMissingWarning
/home/gitlab-runner/builds/9120dac4/0/root/ceph-workbench/teuthology/virtualenv/local/lib/python2.7/site-packages/pip/_vendor/requests/packages/urllib3/util/ssl_.py:122: InsecurePlatformWarning: A true SSLContext object is not available. This prevents urllib3 from configuring SSL appropriately and may cause certain SSL connections to fail. You can upgrade to a newer version of Python to solve this. For more information, see https://urllib3.readthedocs.io/en/latest/security.html#insecureplatformwarning.
  InsecurePlatformWarning
  Using cached boto-2.39.0-py2.py3-none-any.whl
Collecting cffi==1.5.2 (from -r requirements.txt (line 6))
Collecting cliff==2.2.0 (from -r requirements.txt (line 7))
  Using cached cliff-2.2.0-py2-none-any.whl
Collecting keystoneauth1==2.12.1 (from -r requirements.txt (line 8))
  Using cached keystoneauth1-2.12.1-py2.py3-none-any.whl
Collecting openstacksdk==0.9.5 (from -r requirements.txt (line 9))
  Using cached openstacksdk-0.9.5-py2.py3-none-any.whl
Collecting os-client-config==1.21.1 (from -r requirements.txt (line 10))
  Using cached os_client_config-1.21.1-py2.py3-none-any.whl
Collecting osc-lib==1.1.0 (from -r requirements.txt (line 11))
  Using cached osc_lib-1.1.0-py2-none-any.whl
Collecting oslo.config==3.17.0 (from -r requirements.txt (line 12))
  Using cached oslo.config-3.17.0-py2.py3-none-any.whl
Collecting oslo.i18n==3.9.0 (from -r requirements.txt (line 13))
  Using cached oslo.i18n-3.9.0-py2.py3-none-any.whl
Collecting oslo.serialization==2.13.0 (from -r requirements.txt (line 14))
  Using cached oslo.serialization-2.13.0-py2.py3-none-any.whl
Collecting oslo.utils==3.16.0 (from -r requirements.txt (line 15))
  Using cached oslo.utils-3.16.0-py2.py3-none-any.whl
Collecting python-cinderclient==1.9.0 (from -r requirements.txt (line 16))
  Using cached python_cinderclient-1.9.0-py2.py3-none-any.whl
Collecting python-glanceclient==2.5.0 (from -r requirements.txt (line 17))
  Using cached python_glanceclient-2.5.0-py2.py3-none-any.whl
Collecting python-keystoneclient==3.5.0 (from -r requirements.txt (line 18))
  Using cached python_keystoneclient-3.5.0-py2.py3-none-any.whl
Collecting python-neutronclient==4.1.1 (from -r requirements.txt (line 19))
  Using cached python_neutronclient-4.1.1-py2.py3-none-any.whl
Collecting python-novaclient==6.0.0 (from -r requirements.txt (line 20))
  Using cached python_novaclient-6.0.0-py2.py3-none-any.whl
Collecting python-openstackclient==3.2.0 (from -r requirements.txt (line 21))
  Using cached python_openstackclient-3.2.0-py2.py3-none-any.whl
Requirement already up-to-date: setuptools in ./virtualenv/lib/python2.7/site-packages (from teuthology==1.0.0->-r requirements.txt (line 3))
Collecting gevent (from teuthology==1.0.0->-r requirements.txt (line 3))
  Using cached gevent-1.2.1-cp27-cp27mu-manylinux1_x86_64.whl
Collecting MySQL-python==1.2.3 (from teuthology==1.0.0->-r requirements.txt (line 3))
Collecting PyYAML (from teuthology==1.0.0->-r requirements.txt (line 3))
Collecting argparse>=1.2.1 (from teuthology==1.0.0->-r requirements.txt (line 3))
  Using cached argparse-1.4.0-py2.py3-none-any.whl
Collecting beanstalkc>=0.2.0 (from teuthology==1.0.0->-r requirements.txt (line 3))
  Using cached beanstalkc-0.4.0-py27-none-any.whl
Collecting bunch>=1.0.0 (from teuthology==1.0.0->-r requirements.txt (line 3))
Collecting configobj (from teuthology==1.0.0->-r requirements.txt (line 3))
Requirement already up-to-date: six>=1.9 in ./virtualenv/lib/python2.7/site-packages (from teuthology==1.0.0->-r requirements.txt (line 3))
Collecting httplib2 (from teuthology==1.0.0->-r requirements.txt (line 3))
  Downloading httplib2-0.10.3.tar.gz (204kB)
Collecting paramiko>=1.15.1 (from teuthology==1.0.0->-r requirements.txt (line 3))
  Using cached paramiko-2.1.1-py2.py3-none-any.whl
Collecting pexpect (from teuthology==1.0.0->-r requirements.txt (line 3))
  Using cached pexpect-4.2.1-py2.py3-none-any.whl
Collecting requests (from teuthology==1.0.0->-r requirements.txt (line 3))
  Using cached requests-2.13.0-py2.py3-none-any.whl
Collecting raven (from teuthology==1.0.0->-r requirements.txt (line 3))
  Using cached raven-5.32.0-py2.py3-none-any.whl
Collecting web.py (from teuthology==1.0.0->-r requirements.txt (line 3))
  Using cached web.py-0.38.tar.gz
Collecting docopt (from teuthology==1.0.0->-r requirements.txt (line 3))
Collecting psutil>=2.1.0 (from teuthology==1.0.0->-r requirements.txt (line 3))
  Downloading psutil-5.1.3.tar.gz (341kB)
Collecting configparser (from teuthology==1.0.0->-r requirements.txt (line 3))
  Using cached configparser-3.5.0.tar.gz
Collecting pytest (from teuthology==1.0.0->-r requirements.txt (line 3))
  Using cached pytest-3.0.6-py2.py3-none-any.whl
Collecting pytest-capturelog (from teuthology==1.0.0->-r requirements.txt (line 3))
Collecting mock (from teuthology==1.0.0->-r requirements.txt (line 3))
  Downloading mock-2.0.0-py2.py3-none-any.whl (56kB)
Collecting fudge (from teuthology==1.0.0->-r requirements.txt (line 3))
  Downloading fudge-1.1.0.tar.gz (86kB)
Collecting ansible>=2.0 (from teuthology==1.0.0->-r requirements.txt (line 3))
  Using cached ansible-2.2.1.0.tar.gz
Collecting pyopenssl>=0.13 (from teuthology==1.0.0->-r requirements.txt (line 3))
  Using cached pyOpenSSL-16.2.0-py2.py3-none-any.whl
Collecting ndg-httpsclient (from teuthology==1.0.0->-r requirements.txt (line 3))
  Using cached ndg_httpsclient-0.4.2.tar.gz
Collecting pyasn1 (from teuthology==1.0.0->-r requirements.txt (line 3))
  Downloading pyasn1-0.2.2-py2.py3-none-any.whl (51kB)
Collecting prettytable (from teuthology==1.0.0->-r requirements.txt (line 3))
Collecting python-dateutil (from teuthology==1.0.0->-r requirements.txt (line 3))
  Using cached python_dateutil-2.6.0-py2.py3-none-any.whl
Collecting manhole (from teuthology==1.0.0->-r requirements.txt (line 3))
  Downloading manhole-1.3.0-py2.py3-none-any.whl
Collecting pycparser (from cffi==1.5.2->-r requirements.txt (line 6))
  Using cached pycparser-2.17.tar.gz
Collecting pbr>=1.6 (from cliff==2.2.0->-r requirements.txt (line 7))
  Using cached pbr-1.10.0-py2.py3-none-any.whl
Collecting unicodecsv>=0.8.0; python_version < "3.0" (from cliff==2.2.0->-r requirements.txt (line 7))
Collecting cmd2>=0.6.7 (from cliff==2.2.0->-r requirements.txt (line 7))
  Using cached cmd2-0.6.9.tar.gz
Requirement already up-to-date: pyparsing>=2.0.1 in ./virtualenv/lib/python2.7/site-packages (from cliff==2.2.0->-r requirements.txt (line 7))
Collecting stevedore>=1.16.0 (from cliff==2.2.0->-r requirements.txt (line 7))
  Using cached stevedore-1.20.0-py2.py3-none-any.whl
Collecting iso8601>=0.1.11 (from keystoneauth1==2.12.1->-r requirements.txt (line 8))
  Using cached iso8601-0.1.11-py2.py3-none-any.whl
Collecting positional>=1.0.1 (from keystoneauth1==2.12.1->-r requirements.txt (line 8))
Collecting requestsexceptions>=1.1.1 (from os-client-config==1.21.1->-r requirements.txt (line 10))
  Using cached requestsexceptions-1.1.3-py2.py3-none-any.whl
Requirement already up-to-date: appdirs>=1.3.0 in ./virtualenv/lib/python2.7/site-packages (from os-client-config==1.21.1->-r requirements.txt (line 10))
Collecting Babel>=2.3.4 (from osc-lib==1.1.0->-r requirements.txt (line 11))
  Using cached Babel-2.3.4-py2.py3-none-any.whl
Collecting simplejson>=2.2.0 (from osc-lib==1.1.0->-r requirements.txt (line 11))
  Using cached simplejson-3.10.0.tar.gz
Collecting rfc3986>=0.2.0 (from oslo.config==3.17.0->-r requirements.txt (line 12))
  Using cached rfc3986-0.4.1-py2.py3-none-any.whl
Collecting debtcollector>=1.2.0 (from oslo.config==3.17.0->-r requirements.txt (line 12))
  Using cached debtcollector-1.11.0-py2.py3-none-any.whl
Collecting netaddr!=0.7.16,>=0.7.12 (from oslo.config==3.17.0->-r requirements.txt (line 12))
  Using cached netaddr-0.7.19-py2.py3-none-any.whl
Collecting msgpack-python>=0.4.0 (from oslo.serialization==2.13.0->-r requirements.txt (line 14))
Collecting pytz>=2013.6 (from oslo.serialization==2.13.0->-r requirements.txt (line 14))
  Using cached pytz-2016.10-py2.py3-none-any.whl
Collecting funcsigs>=0.4; python_version == "2.7" or python_version == "2.6" (from oslo.utils==3.16.0->-r requirements.txt (line 15))
  Using cached funcsigs-1.0.2-py2.py3-none-any.whl
Collecting monotonic>=0.6 (from oslo.utils==3.16.0->-r requirements.txt (line 15))
  Using cached monotonic-1.2-py2.py3-none-any.whl
Collecting netifaces>=0.10.4 (from oslo.utils==3.16.0->-r requirements.txt (line 15))
Collecting warlock!=1.3.0,<2,>=1.0.1 (from python-glanceclient==2.5.0->-r requirements.txt (line 17))
Requirement already up-to-date: packaging>=16.8 in ./virtualenv/lib/python2.7/site-packages (from setuptools->teuthology==1.0.0->-r requirements.txt (line 3))
Collecting greenlet>=0.4.10 (from gevent->teuthology==1.0.0->-r requirements.txt (line 3))
  Using cached greenlet-0.4.12-cp27-cp27mu-manylinux1_x86_64.whl
Collecting cryptography>=1.1 (from paramiko>=1.15.1->teuthology==1.0.0->-r requirements.txt (line 3))
  Using cached cryptography-1.7.2.tar.gz
Collecting ptyprocess>=0.5 (from pexpect->teuthology==1.0.0->-r requirements.txt (line 3))
  Using cached ptyprocess-0.5.1-py2.py3-none-any.whl
Collecting contextlib2 (from raven->teuthology==1.0.0->-r requirements.txt (line 3))
  Using cached contextlib2-0.5.4-py2.py3-none-any.whl
Collecting py>=1.4.29 (from pytest->teuthology==1.0.0->-r requirements.txt (line 3))
  Using cached py-1.4.32-py2.py3-none-any.whl
Collecting jinja2<2.9 (from ansible>=2.0->teuthology==1.0.0->-r requirements.txt (line 3))
  Using cached Jinja2-2.8.1-py2.py3-none-any.whl
Collecting pycrypto>=2.6 (from ansible>=2.0->teuthology==1.0.0->-r requirements.txt (line 3))
Collecting wrapt (from positional>=1.0.1->keystoneauth1==2.12.1->-r requirements.txt (line 8))
Collecting jsonschema<3,>=0.7 (from warlock!=1.3.0,<2,>=1.0.1->python-glanceclient==2.5.0->-r requirements.txt (line 17))
  Using cached jsonschema-2.6.0-py2.py3-none-any.whl
Collecting jsonpatch<2,>=0.10 (from warlock!=1.3.0,<2,>=1.0.1->python-glanceclient==2.5.0->-r requirements.txt (line 17))
  Using cached jsonpatch-1.15-py2.py3-none-any.whl
Collecting idna>=2.0 (from cryptography>=1.1->paramiko>=1.15.1->teuthology==1.0.0->-r requirements.txt (line 3))
  Using cached idna-2.2-py2.py3-none-any.whl
Collecting enum34 (from cryptography>=1.1->paramiko>=1.15.1->teuthology==1.0.0->-r requirements.txt (line 3))
  Using cached enum34-1.1.6-py2-none-any.whl
Collecting ipaddress (from cryptography>=1.1->paramiko>=1.15.1->teuthology==1.0.0->-r requirements.txt (line 3))
  Using cached ipaddress-1.0.18-py2-none-any.whl
Collecting MarkupSafe (from jinja2<2.9->ansible>=2.0->teuthology==1.0.0->-r requirements.txt (line 3))
Collecting functools32; python_version == "2.7" (from jsonschema<3,>=0.7->warlock!=1.3.0,<2,>=1.0.1->python-glanceclient==2.5.0->-r requirements.txt (line 17))
Collecting jsonpointer>=1.9 (from jsonpatch<2,>=0.10->warlock!=1.3.0,<2,>=1.0.1->python-glanceclient==2.5.0->-r requirements.txt (line 17))
  Using cached jsonpointer-1.10-py2-none-any.whl
Installing collected packages: boto, pycparser, cffi, prettytable, pbr, unicodecsv, cmd2, PyYAML, stevedore, cliff, requests, iso8601, wrapt, positional, keystoneauth1, requestsexceptions, os-client-config, openstacksdk, funcsigs, pytz, Babel, oslo.i18n, monotonic, netifaces, debtcollector, netaddr, oslo.utils, simplejson, osc-lib, rfc3986, oslo.config, msgpack-python, oslo.serialization, python-cinderclient, python-keystoneclient, functools32, jsonschema, jsonpointer, jsonpatch, warlock, python-glanceclient, python-neutronclient, python-novaclient, python-openstackclient, greenlet, gevent, MySQL-python, argparse, beanstalkc, bunch, configobj, httplib2, idna, pyasn1, enum34, ipaddress, cryptography, paramiko, ptyprocess, pexpect, contextlib2, raven, web.py, docopt, psutil, configparser, py, pytest, pytest-capturelog, mock, fudge, MarkupSafe, jinja2, pycrypto, ansible, pyopenssl, ndg-httpsclient, python-dateutil, manhole, teuthology
  Running setup.py install for pycparser: started
    Running setup.py install for pycparser: finished with status 'done'
  Running setup.py install for cmd2: started
    Running setup.py install for cmd2: finished with status 'done'
  Running setup.py install for simplejson: started
    Running setup.py install for simplejson: finished with status 'done'
  Found existing installation: argparse 1.2.1
    Not uninstalling argparse at /usr/lib/python2.7, outside environment /home/gitlab-runner/builds/9120dac4/0/root/ceph-workbench/teuthology/virtualenv
  Running setup.py install for httplib2: started
    Running setup.py install for httplib2: finished with status 'done'
  Running setup.py install for cryptography: started
    Running setup.py install for cryptography: finished with status 'done'
  Running setup.py install for web.py: started
    Running setup.py install for web.py: finished with status 'done'
  Running setup.py install for psutil: started
    Running setup.py install for psutil: finished with status 'done'
  Running setup.py install for configparser: started
    Running setup.py install for configparser: finished with status 'done'
  Running setup.py install for fudge: started
    Running setup.py install for fudge: finished with status 'done'
  Running setup.py install for ansible: started
    Running setup.py install for ansible: finished with status 'done'
  Running setup.py install for ndg-httpsclient: started
    Running setup.py install for ndg-httpsclient: finished with status 'done'
  Running setup.py develop for teuthology
Successfully installed Babel-2.3.4 MarkupSafe-0.23 MySQL-python-1.2.3 PyYAML-3.12 ansible-2.2.1.0 argparse-1.4.0 beanstalkc-0.4.0 boto-2.39.0 bunch-1.0.1 cffi-1.5.2 cliff-2.2.0 cmd2-0.6.9 configobj-5.0.6 configparser-3.5.0 contextlib2-0.5.4 cryptography-1.7.2 debtcollector-1.11.0 docopt-0.6.2 enum34-1.1.6 fudge-1.1.0 funcsigs-1.0.2 functools32-3.2.3.post2 gevent-1.2.1 greenlet-0.4.12 httplib2-0.10.3 idna-2.2 ipaddress-1.0.18 iso8601-0.1.11 jinja2-2.8.1 jsonpatch-1.15 jsonpointer-1.10 jsonschema-2.6.0 keystoneauth1-2.12.1 manhole-1.3.0 mock-2.0.0 monotonic-1.2 msgpack-python-0.4.8 ndg-httpsclient-0.4.2 netaddr-0.7.19 netifaces-0.10.5 openstacksdk-0.9.5 os-client-config-1.21.1 osc-lib-1.1.0 oslo.config-3.17.0 oslo.i18n-3.9.0 oslo.serialization-2.13.0 oslo.utils-3.16.0 paramiko-2.1.1 pbr-1.10.0 pexpect-4.2.1 positional-1.1.1 prettytable-0.7.2 psutil-5.1.3 ptyprocess-0.5.1 py-1.4.32 pyasn1-0.2.2 pycparser-2.17 pycrypto-2.6.1 pyopenssl-16.2.0 pytest-3.0.6 pytest-capturelog-0.7 python-cinderclient-1.9.0 python-dateutil-2.6.0 python-glanceclient-2.5.0 python-keystoneclient-3.5.0 python-neutronclient-4.1.1 python-novaclient-6.0.0 python-openstackclient-3.2.0 pytz-2016.10 raven-5.32.0 requests-2.13.0 requestsexceptions-1.1.3 rfc3986-0.4.1 simplejson-3.10.0 stevedore-1.20.0 teuthology unicodecsv-0.14.1 warlock-1.2.0 web.py-0.38 wrapt-1.10.8
++ rm -fr virtualenv .tox
++ virtualenv virtualenv
New python executable in virtualenv/bin/python
Installing setuptools, pip...done.
++ source virtualenv/bin/activate
+++ deactivate nondestructive
+++ unset pydoc
+++ '[' -n '' ']'
+++ '[' -n '' ']'
+++ '[' -n /bin/bash -o -n '' ']'
+++ hash -r
+++ '[' -n '' ']'
+++ unset VIRTUAL_ENV
+++ '[' '!' nondestructive = nondestructive ']'
+++ VIRTUAL_ENV=/home/gitlab-runner/builds/9120dac4/0/root/ceph-workbench/virtualenv
+++ export VIRTUAL_ENV
+++ _OLD_VIRTUAL_PATH=/usr/local/bin:/usr/bin:/bin:/usr/local/games:/usr/games
+++ PATH=/home/gitlab-runner/builds/9120dac4/0/root/ceph-workbench/virtualenv/bin:/usr/local/bin:/usr/bin:/bin:/usr/local/games:/usr/games
+++ export PATH
+++ '[' -n '' ']'
+++ '[' -z '' ']'
+++ _OLD_VIRTUAL_PS1=
+++ '[' x '!=' x ']'
++++ basename /home/gitlab-runner/builds/9120dac4/0/root/ceph-workbench/virtualenv
+++ '[' virtualenv = __ ']'
++++ basename /home/gitlab-runner/builds/9120dac4/0/root/ceph-workbench/virtualenv
+++ PS1='(virtualenv)'
+++ export PS1
+++ alias 'pydoc=python -m pydoc'
+++ '[' -n /bin/bash -o -n '' ']'
+++ hash -r
++ pip install --upgrade pip
Downloading/unpacking pip from https://pypi.python.org/packages/b6/ac/7015eb97dc749283ffdec1c3a88ddb8ae03b8fad0f0e611408f196358da3/pip-9.0.1-py2.py3-none-any.whl#md5=297dbd16ef53bcef0447d245815f5144
Installing collected packages: pip
  Found existing installation: pip 1.5.4
    Uninstalling pip:
      Successfully uninstalled pip
Successfully installed pip
Cleaning up...
++ pip install --upgrade setuptools
Collecting setuptools
  Using cached setuptools-34.1.1-py2.py3-none-any.whl
Collecting packaging>=16.8 (from setuptools)
  Using cached packaging-16.8-py2.py3-none-any.whl
Collecting appdirs>=1.4.0 (from setuptools)
  Using cached appdirs-1.4.0-py2.py3-none-any.whl
Collecting six>=1.6.0 (from setuptools)
  Using cached six-1.10.0-py2.py3-none-any.whl
Collecting pyparsing (from packaging>=16.8->setuptools)
  Using cached pyparsing-2.1.10-py2.py3-none-any.whl
Installing collected packages: six, pyparsing, packaging, appdirs, setuptools
  Found existing installation: setuptools 2.2
    Uninstalling setuptools-2.2:
      Successfully uninstalled setuptools-2.2
Successfully installed appdirs-1.4.0 packaging-16.8 pyparsing-2.1.10 setuptools-34.1.1 six-1.10.0
++ pip install -r requirements.txt
Collecting alabaster==0.7.7 (from -r requirements.txt (line 1))
/home/gitlab-runner/builds/9120dac4/0/root/ceph-workbench/virtualenv/local/lib/python2.7/site-packages/pip/_vendor/requests/packages/urllib3/util/ssl_.py:318: SNIMissingWarning: An HTTPS request has been made, but the SNI (Subject Name Indication) extension to TLS is not available on this platform. This may cause the server to present an incorrect TLS certificate, which can cause validation failures. You can upgrade to a newer version of Python to solve this. For more information, see https://urllib3.readthedocs.io/en/latest/security.html#snimissingwarning.
  SNIMissingWarning
/home/gitlab-runner/builds/9120dac4/0/root/ceph-workbench/virtualenv/local/lib/python2.7/site-packages/pip/_vendor/requests/packages/urllib3/util/ssl_.py:122: InsecurePlatformWarning: A true SSLContext object is not available. This prevents urllib3 from configuring SSL appropriately and may cause certain SSL connections to fail. You can upgrade to a newer version of Python to solve this. For more information, see https://urllib3.readthedocs.io/en/latest/security.html#insecureplatformwarning.
  InsecurePlatformWarning
  Using cached alabaster-0.7.7-py2.py3-none-any.whl
Collecting ansible==2.1.1.0 (from -r requirements.txt (line 2))
Requirement already satisfied: appdirs==1.4.0 in ./virtualenv/lib/python2.7/site-packages (from -r requirements.txt (line 3))
Collecting Babel==2.3.4 (from -r requirements.txt (line 4))
  Using cached Babel-2.3.4-py2.py3-none-any.whl
Collecting beanstalkc==0.4.0 (from -r requirements.txt (line 5))
  Using cached beanstalkc-0.4.0-py27-none-any.whl
Collecting boto==2.39.0 (from -r requirements.txt (line 6))
  Using cached boto-2.39.0-py2.py3-none-any.whl
Collecting bunch==1.0.1 (from -r requirements.txt (line 7))
Collecting cffi==1.5.2 (from -r requirements.txt (line 8))
Collecting cliff==2.2.0 (from -r requirements.txt (line 9))
  Using cached cliff-2.2.0-py2-none-any.whl
Collecting cmd2==0.6.8 (from -r requirements.txt (line 10))
Collecting configobj==5.0.6 (from -r requirements.txt (line 11))
Collecting configparser==3.3.0.post2 (from -r requirements.txt (line 12))
Collecting contextlib2==0.5.1 (from -r requirements.txt (line 13))
Collecting coverage==4.0.3 (from -r requirements.txt (line 14))
Collecting cryptography==1.3 (from -r requirements.txt (line 15))
Collecting d2to1==0.2.12.post1 (from -r requirements.txt (line 16))
Collecting debtcollector==1.8.0 (from -r requirements.txt (line 17))
  Using cached debtcollector-1.8.0-py2.py3-none-any.whl
Collecting discover==0.4.0 (from -r requirements.txt (line 18))
Collecting docopt==0.6.2 (from -r requirements.txt (line 19))
Collecting docutils==0.12 (from -r requirements.txt (line 20))
Collecting ecdsa==0.13 (from -r requirements.txt (line 21))
  Using cached ecdsa-0.13-py2.py3-none-any.whl
Collecting enum34==1.1.2 (from -r requirements.txt (line 22))
Collecting extras==0.0.3 (from -r requirements.txt (line 23))
Collecting fixtures==1.4.0 (from -r requirements.txt (line 24))
  Using cached fixtures-1.4.0-py2.py3-none-any.whl
Collecting flake8==2.2.4 (from -r requirements.txt (line 25))
Collecting funcsigs==1.0.2 (from -r requirements.txt (line 26))
  Using cached funcsigs-1.0.2-py2.py3-none-any.whl
Collecting functools32==3.2.3.post2 (from -r requirements.txt (line 27))
Collecting gevent==1.0.2 (from -r requirements.txt (line 28))
Collecting gitdb==0.6.4 (from -r requirements.txt (line 29))
Collecting github2gitlab==1.5.5 (from -r requirements.txt (line 30))
Collecting githubpy==1.1.0 (from -r requirements.txt (line 31))
Collecting GitPython==1.0.2 (from -r requirements.txt (line 32))
Collecting greenlet==0.4.9 (from -r requirements.txt (line 33))
Collecting hacking==0.10.2 (from -r requirements.txt (line 34))
  Using cached hacking-0.10.2-py2.py3-none-any.whl
Collecting httplib2==0.9.2 (from -r requirements.txt (line 35))
Collecting idna==2.0 (from -r requirements.txt (line 36))
  Using cached idna-2.0-py2.py3-none-any.whl
Collecting ipaddress==1.0.16 (from -r requirements.txt (line 37))
  Using cached ipaddress-1.0.16-py27-none-any.whl
Collecting iso8601==0.1.11 (from -r requirements.txt (line 38))
  Using cached iso8601-0.1.11-py2.py3-none-any.whl
Collecting Jinja2==2.8 (from -r requirements.txt (line 39))
  Using cached Jinja2-2.8-py2.py3-none-any.whl
Collecting jsonpatch==1.14 (from -r requirements.txt (line 40))
  Using cached jsonpatch-1.14-py2.py3-none-any.whl
Collecting jsonpointer==1.10 (from -r requirements.txt (line 41))
  Using cached jsonpointer-1.10-py2-none-any.whl
Collecting jsonschema==2.5.1 (from -r requirements.txt (line 42))
  Using cached jsonschema-2.5.1-py2.py3-none-any.whl
Collecting keystoneauth1==2.12.1 (from -r requirements.txt (line 43))
  Using cached keystoneauth1-2.12.1-py2.py3-none-any.whl
Collecting linecache2==1.0.0 (from -r requirements.txt (line 44))
  Using cached linecache2-1.0.0-py2.py3-none-any.whl
Collecting MarkupSafe==0.23 (from -r requirements.txt (line 45))
Collecting mccabe==0.2.1 (from -r requirements.txt (line 46))
Collecting mock==1.3.0 (from -r requirements.txt (line 47))
  Using cached mock-1.3.0-py2.py3-none-any.whl
Collecting monotonic==1.2 (from -r requirements.txt (line 48))
  Using cached monotonic-1.2-py2.py3-none-any.whl
Collecting msgpack-python==0.4.8 (from -r requirements.txt (line 49))
Collecting MySQL-python==1.2.3 (from -r requirements.txt (line 50))
Collecting mysqlclient==1.3.7 (from -r requirements.txt (line 51))
Collecting ndg-httpsclient==0.4.0 (from -r requirements.txt (line 52))
Collecting netaddr==0.7.18 (from -r requirements.txt (line 53))
  Using cached netaddr-0.7.18-py2.py3-none-any.whl
Collecting netifaces==0.10.5 (from -r requirements.txt (line 54))
Collecting openstacksdk==0.9.5 (from -r requirements.txt (line 55))
  Using cached openstacksdk-0.9.5-py2.py3-none-any.whl
Collecting os-client-config==1.21.1 (from -r requirements.txt (line 56))
  Using cached os_client_config-1.21.1-py2.py3-none-any.whl
Collecting osc-lib==1.1.0 (from -r requirements.txt (line 57))
  Using cached osc_lib-1.1.0-py2-none-any.whl
Collecting oslo.config==3.17.0 (from -r requirements.txt (line 58))
  Using cached oslo.config-3.17.0-py2.py3-none-any.whl
Collecting oslo.i18n==3.9.0 (from -r requirements.txt (line 59))
  Using cached oslo.i18n-3.9.0-py2.py3-none-any.whl
Collecting oslo.serialization==2.13.0 (from -r requirements.txt (line 60))
  Using cached oslo.serialization-2.13.0-py2.py3-none-any.whl
Collecting oslo.utils==3.16.0 (from -r requirements.txt (line 61))
  Using cached oslo.utils-3.16.0-py2.py3-none-any.whl
Collecting paramiko==1.16.0 (from -r requirements.txt (line 62))
  Using cached paramiko-1.16.0-py2.py3-none-any.whl
Collecting pbr==1.10.0 (from -r requirements.txt (line 63))
  Using cached pbr-1.10.0-py2.py3-none-any.whl
Collecting pep8==1.5.7 (from -r requirements.txt (line 64))
  Using cached pep8-1.5.7-py2.py3-none-any.whl
Collecting pexpect==4.0.1 (from -r requirements.txt (line 65))
Collecting pip==8.1.2 (from -r requirements.txt (line 66))
  Using cached pip-8.1.2-py2.py3-none-any.whl
Collecting pluggy==0.3.1 (from -r requirements.txt (line 67))
  Using cached pluggy-0.3.1-py2.py3-none-any.whl
Collecting positional==1.1.1 (from -r requirements.txt (line 68))
Collecting prettytable==0.7.2 (from -r requirements.txt (line 69))
Collecting psutil==4.1.0 (from -r requirements.txt (line 70))
Collecting ptyprocess==0.5.1 (from -r requirements.txt (line 71))
  Using cached ptyprocess-0.5.1-py2.py3-none-any.whl
Collecting py==1.4.31 (from -r requirements.txt (line 72))
  Using cached py-1.4.31-py2.py3-none-any.whl
Collecting pyasn1==0.1.9 (from -r requirements.txt (line 73))
  Using cached pyasn1-0.1.9-py2.py3-none-any.whl
Collecting pycparser==2.14 (from -r requirements.txt (line 74))
Collecting pycrypto==2.6.1 (from -r requirements.txt (line 75))
Collecting pyflakes==0.8.1 (from -r requirements.txt (line 76))
  Using cached pyflakes-0.8.1-py2.py3-none-any.whl
Collecting Pygments==2.1.3 (from -r requirements.txt (line 77))
  Using cached Pygments-2.1.3-py2.py3-none-any.whl
Collecting pyOpenSSL==0.15.1 (from -r requirements.txt (line 78))
  Using cached pyOpenSSL-0.15.1-py2.py3-none-any.whl
Collecting pyparsing==2.1.8 (from -r requirements.txt (line 79))
  Using cached pyparsing-2.1.8-py2.py3-none-any.whl
Collecting pyrsistent==0.11.12 (from -r requirements.txt (line 80))
Collecting pytest==2.9.0 (from -r requirements.txt (line 81))
  Using cached pytest-2.9.0-py2.py3-none-any.whl
Collecting pytest-capturelog==0.7 (from -r requirements.txt (line 82))
Collecting python-cinderclient==1.9.0 (from -r requirements.txt (line 83))
  Using cached python_cinderclient-1.9.0-py2.py3-none-any.whl
Collecting python-dateutil==2.5.3 (from -r requirements.txt (line 84))
  Using cached python_dateutil-2.5.3-py2.py3-none-any.whl
Collecting python-glanceclient==2.5.0 (from -r requirements.txt (line 85))
  Using cached python_glanceclient-2.5.0-py2.py3-none-any.whl
Collecting python-keystoneclient==3.5.0 (from -r requirements.txt (line 86))
  Using cached python_keystoneclient-3.5.0-py2.py3-none-any.whl
Collecting python-mimeparse==1.5.1 (from -r requirements.txt (line 87))
Collecting python-neutronclient==4.1.1 (from -r requirements.txt (line 88))
  Using cached python_neutronclient-4.1.1-py2.py3-none-any.whl
Collecting python-novaclient==6.0.0 (from -r requirements.txt (line 89))
  Using cached python_novaclient-6.0.0-py2.py3-none-any.whl
Collecting python-openstackclient==3.2.0 (from -r requirements.txt (line 90))
  Using cached python_openstackclient-3.2.0-py2.py3-none-any.whl
Collecting python-redmine==1.5.0 (from -r requirements.txt (line 91))
  Using cached python_redmine-1.5.0-py2.py3-none-any.whl
Collecting python-subunit==1.2.0 (from -r requirements.txt (line 92))
  Using cached python_subunit-1.2.0-py2.py3-none-any.whl
Collecting pytz==2016.6.1 (from -r requirements.txt (line 93))
  Using cached pytz-2016.6.1-py2.py3-none-any.whl
Collecting PyYAML==3.12 (from -r requirements.txt (line 94))
Collecting raven==5.11.1 (from -r requirements.txt (line 95))
  Using cached raven-5.11.1-py2.py3-none-any.whl
Collecting requests==2.11.1 (from -r requirements.txt (line 96))
  Using cached requests-2.11.1-py2.py3-none-any.whl
Collecting requestsexceptions==1.1.3 (from -r requirements.txt (line 97))
  Using cached requestsexceptions-1.1.3-py2.py3-none-any.whl
Collecting setuptools==20.3.1 (from -r requirements.txt (line 98))
  Using cached setuptools-20.3.1-py2.py3-none-any.whl
Collecting simplejson==3.8.2 (from -r requirements.txt (line 99))
Requirement already satisfied: six==1.10.0 in ./virtualenv/lib/python2.7/site-packages (from -r requirements.txt (line 100))
Collecting smmap==0.9.0 (from -r requirements.txt (line 101))
Collecting snowballstemmer==1.2.1 (from -r requirements.txt (line 102))
  Using cached snowballstemmer-1.2.1-py2.py3-none-any.whl
Collecting Sphinx==1.3.6 (from -r requirements.txt (line 103))
  Using cached Sphinx-1.3.6-py2.py3-none-any.whl
Collecting sphinx-rtd-theme==0.1.9 (from -r requirements.txt (line 104))
  Using cached sphinx_rtd_theme-0.1.9-py2-none-any.whl
Collecting stevedore==1.17.1 (from -r requirements.txt (line 105))
  Using cached stevedore-1.17.1-py2.py3-none-any.whl
Collecting testrepository==0.0.20 (from -r requirements.txt (line 106))
Collecting testtools==2.0.0 (from -r requirements.txt (line 107))
  Using cached testtools-2.0.0-py2.py3-none-any.whl
Collecting tox==2.3.1 (from -r requirements.txt (line 108))
  Using cached tox-2.3.1-py2.py3-none-any.whl
Collecting traceback2==1.4.0 (from -r requirements.txt (line 109))
  Using cached traceback2-1.4.0-py2.py3-none-any.whl
Collecting unicodecsv==0.14.1 (from -r requirements.txt (line 110))
Collecting unittest2==1.1.0 (from -r requirements.txt (line 111))
  Using cached unittest2-1.1.0-py2.py3-none-any.whl
Collecting virtualenv==15.0.1 (from -r requirements.txt (line 112))
  Using cached virtualenv-15.0.1-py2.py3-none-any.whl
Collecting warlock==1.2.0 (from -r requirements.txt (line 113))
Collecting web.py==0.37 (from -r requirements.txt (line 114))
Collecting wrapt==1.10.8 (from -r requirements.txt (line 115))
Collecting rfc3986>=0.2.0 (from oslo.config==3.17.0->-r requirements.txt (line 58))
  Using cached rfc3986-0.4.1-py2.py3-none-any.whl
Requirement already satisfied: argparse in /usr/lib/python2.7 (from unittest2==1.1.0->-r requirements.txt (line 111))
Installing collected packages: alabaster, MarkupSafe, Jinja2, PyYAML, pycrypto, ecdsa, paramiko, setuptools, ansible, pytz, Babel, beanstalkc, boto, bunch, pycparser, cffi, prettytable, pbr, unicodecsv, pyparsing, cmd2, stevedore, cliff, configobj, configparser, contextlib2, coverage, idna, ipaddress, enum34, pyasn1, cryptography, d2to1, wrapt, funcsigs, debtcollector, discover, docopt, docutils, extras, linecache2, traceback2, python-mimeparse, pyrsistent, unittest2, testtools, fixtures, mccabe, pep8, pyflakes, flake8, functools32, greenlet, gevent, smmap, gitdb, requests, GitPython, github2gitlab, githubpy, hacking, httplib2, iso8601, jsonpointer, jsonpatch, jsonschema, positional, keystoneauth1, mock, monotonic, msgpack-python, MySQL-python, mysqlclient, pyOpenSSL, ndg-httpsclient, netaddr, netifaces, requestsexceptions, os-client-config, openstacksdk, oslo.i18n, oslo.utils, simplejson, osc-lib, rfc3986, oslo.config, oslo.serialization, ptyprocess, pexpect, pip, pluggy, psutil, py, Pygments, pytest, pytest-capturelog, python-cinderclient, python-dateutil, python-keystoneclient, warlock, python-glanceclient, python-neutronclient, python-novaclient, python-openstackclient, python-redmine, python-subunit, raven, snowballstemmer, sphinx-rtd-theme, Sphinx, testrepository, virtualenv, tox, web.py
  Found existing installation: setuptools 34.1.1
    Uninstalling setuptools-34.1.1:
      Successfully uninstalled setuptools-34.1.1
  Found existing installation: pyparsing 2.1.10
    Uninstalling pyparsing-2.1.10:
      Successfully uninstalled pyparsing-2.1.10
  Found existing installation: pip 9.0.1
    Uninstalling pip-9.0.1:
      Successfully uninstalled pip-9.0.1
Successfully installed Babel-2.3.4 GitPython-1.0.2 Jinja2-2.8 MarkupSafe-0.23 MySQL-python-1.2.3 PyYAML-3.12 Pygments-2.1.3 Sphinx-1.3.6 alabaster-0.7.7 ansible-2.1.1.0 beanstalkc-0.4.0 boto-2.39.0 bunch-1.0.1 cffi-1.5.2 cliff-2.2.0 cmd2-0.6.8 configobj-5.0.6 configparser-3.3.0.post2 contextlib2-0.5.1 coverage-4.0.3 cryptography-1.3 d2to1-0.2.12.post1 debtcollector-1.8.0 discover-0.4.0 docopt-0.6.2 docutils-0.12 ecdsa-0.13 enum34-1.1.2 extras-0.0.3 fixtures-1.4.0 flake8-2.2.4 funcsigs-1.0.2 functools32-3.2.3.post2 gevent-1.0.2 gitdb-0.6.4 github2gitlab-1.5.5 githubpy-1.1.0 greenlet-0.4.9 hacking-0.10.2 httplib2-0.9.2 idna-2.0 ipaddress-1.0.16 iso8601-0.1.11 jsonpatch-1.14 jsonpointer-1.10 jsonschema-2.5.1 keystoneauth1-2.12.1 linecache2-1.0.0 mccabe-0.2.1 mock-1.3.0 monotonic-1.2 msgpack-python-0.4.8 mysqlclient-1.3.7 ndg-httpsclient-0.4.0 netaddr-0.7.18 netifaces-0.10.5 openstacksdk-0.9.5 os-client-config-1.21.1 osc-lib-1.1.0 oslo.config-3.17.0 oslo.i18n-3.9.0 oslo.serialization-2.13.0 oslo.utils-3.16.0 paramiko-1.16.0 pbr-1.10.0 pep8-1.5.7 pexpect-4.0.1 pip-8.1.2 pluggy-0.3.1 positional-1.1.1 prettytable-0.7.2 psutil-4.1.0 ptyprocess-0.5.1 py-1.4.31 pyOpenSSL-0.15.1 pyasn1-0.1.9 pycparser-2.14 pycrypto-2.6.1 pyflakes-0.8.1 pyparsing-2.1.8 pyrsistent-0.11.12 pytest-2.9.0 pytest-capturelog-0.7 python-cinderclient-1.9.0 python-dateutil-2.5.3 python-glanceclient-2.5.0 python-keystoneclient-3.5.0 python-mimeparse-1.5.1 python-neutronclient-4.1.1 python-novaclient-6.0.0 python-openstackclient-3.2.0 python-redmine-1.5.0 python-subunit-1.2.0 pytz-2016.6.1 raven-5.11.1 requests-2.11.1 requestsexceptions-1.1.3 rfc3986-0.4.1 setuptools-20.3.1 simplejson-3.8.2 smmap-0.9.0 snowballstemmer-1.2.1 sphinx-rtd-theme-0.1.9 stevedore-1.17.1 testrepository-0.0.20 testtools-2.0.0 tox-2.3.1 traceback2-1.4.0 unicodecsv-0.14.1 unittest2-1.1.0 virtualenv-15.0.1 warlock-1.2.0 web.py-0.37 wrapt-1.10.8
You are using pip version 8.1.2, however version 9.0.1 is available.
You should consider upgrading via the 'pip install --upgrade pip' command.
++ pip install -e teuthology
Obtaining file:///home/gitlab-runner/builds/9120dac4/0/root/ceph-workbench/teuthology
Requirement already satisfied (use --upgrade to upgrade): setuptools in ./virtualenv/lib/python2.7/site-packages (from teuthology==1.0.0)
Requirement already satisfied (use --upgrade to upgrade): gevent in ./virtualenv/lib/python2.7/site-packages (from teuthology==1.0.0)
Requirement already satisfied (use --upgrade to upgrade): MySQL-python==1.2.3 in ./virtualenv/lib/python2.7/site-packages (from teuthology==1.0.0)
Requirement already satisfied (use --upgrade to upgrade): PyYAML in ./virtualenv/lib/python2.7/site-packages (from teuthology==1.0.0)
Requirement already satisfied (use --upgrade to upgrade): argparse>=1.2.1 in /usr/lib/python2.7 (from teuthology==1.0.0)
Requirement already satisfied (use --upgrade to upgrade): beanstalkc>=0.2.0 in ./virtualenv/lib/python2.7/site-packages (from teuthology==1.0.0)
Requirement already satisfied (use --upgrade to upgrade): boto>=2.0b4 in ./virtualenv/lib/python2.7/site-packages (from teuthology==1.0.0)
Requirement already satisfied (use --upgrade to upgrade): bunch>=1.0.0 in ./virtualenv/lib/python2.7/site-packages (from teuthology==1.0.0)
Requirement already satisfied (use --upgrade to upgrade): configobj in ./virtualenv/lib/python2.7/site-packages (from teuthology==1.0.0)
Requirement already satisfied (use --upgrade to upgrade): six>=1.9 in ./virtualenv/lib/python2.7/site-packages (from teuthology==1.0.0)
Requirement already satisfied (use --upgrade to upgrade): httplib2 in ./virtualenv/lib/python2.7/site-packages (from teuthology==1.0.0)
Requirement already satisfied (use --upgrade to upgrade): paramiko>=1.15.1 in ./virtualenv/lib/python2.7/site-packages (from teuthology==1.0.0)
Requirement already satisfied (use --upgrade to upgrade): pexpect in ./virtualenv/lib/python2.7/site-packages (from teuthology==1.0.0)
Requirement already satisfied (use --upgrade to upgrade): requests in ./virtualenv/lib/python2.7/site-packages (from teuthology==1.0.0)
Requirement already satisfied (use --upgrade to upgrade): raven in ./virtualenv/lib/python2.7/site-packages (from teuthology==1.0.0)
Requirement already satisfied (use --upgrade to upgrade): web.py in ./virtualenv/lib/python2.7/site-packages (from teuthology==1.0.0)
Requirement already satisfied (use --upgrade to upgrade): docopt in ./virtualenv/lib/python2.7/site-packages (from teuthology==1.0.0)
Requirement already satisfied (use --upgrade to upgrade): psutil>=2.1.0 in ./virtualenv/lib/python2.7/site-packages (from teuthology==1.0.0)
Requirement already satisfied (use --upgrade to upgrade): configparser in ./virtualenv/lib/python2.7/site-packages (from teuthology==1.0.0)
Requirement already satisfied (use --upgrade to upgrade): pytest in ./virtualenv/lib/python2.7/site-packages (from teuthology==1.0.0)
Requirement already satisfied (use --upgrade to upgrade): pytest-capturelog in ./virtualenv/lib/python2.7/site-packages (from teuthology==1.0.0)
Requirement already satisfied (use --upgrade to upgrade): mock in ./virtualenv/lib/python2.7/site-packages (from teuthology==1.0.0)
Collecting fudge (from teuthology==1.0.0)
  Using cached fudge-1.1.0.tar.gz
Requirement already satisfied (use --upgrade to upgrade): ansible>=2.0 in ./virtualenv/lib/python2.7/site-packages (from teuthology==1.0.0)
Requirement already satisfied (use --upgrade to upgrade): pyopenssl>=0.13 in ./virtualenv/lib/python2.7/site-packages (from teuthology==1.0.0)
Requirement already satisfied (use --upgrade to upgrade): ndg-httpsclient in ./virtualenv/lib/python2.7/site-packages (from teuthology==1.0.0)
Requirement already satisfied (use --upgrade to upgrade): pyasn1 in ./virtualenv/lib/python2.7/site-packages (from teuthology==1.0.0)
Requirement already satisfied (use --upgrade to upgrade): prettytable in ./virtualenv/lib/python2.7/site-packages (from teuthology==1.0.0)
Requirement already satisfied (use --upgrade to upgrade): python-dateutil in ./virtualenv/lib/python2.7/site-packages (from teuthology==1.0.0)
Collecting manhole (from teuthology==1.0.0)
  Using cached manhole-1.3.0-py2.py3-none-any.whl
Requirement already satisfied (use --upgrade to upgrade): greenlet>=0.4.7 in ./virtualenv/lib/python2.7/site-packages (from gevent->teuthology==1.0.0)
Requirement already satisfied (use --upgrade to upgrade): pycrypto!=2.4,>=2.1 in ./virtualenv/lib/python2.7/site-packages (from paramiko>=1.15.1->teuthology==1.0.0)
Requirement already satisfied (use --upgrade to upgrade): ecdsa>=0.11 in ./virtualenv/lib/python2.7/site-packages (from paramiko>=1.15.1->teuthology==1.0.0)
Requirement already satisfied (use --upgrade to upgrade): ptyprocess>=0.5 in ./virtualenv/lib/python2.7/site-packages (from pexpect->teuthology==1.0.0)
Requirement already satisfied (use --upgrade to upgrade): contextlib2 in ./virtualenv/lib/python2.7/site-packages (from raven->teuthology==1.0.0)
Requirement already satisfied (use --upgrade to upgrade): py>=1.4.29 in ./virtualenv/lib/python2.7/site-packages (from pytest->teuthology==1.0.0)
Requirement already satisfied (use --upgrade to upgrade): funcsigs; python_version < "3.3" in ./virtualenv/lib/python2.7/site-packages (from mock->teuthology==1.0.0)
Requirement already satisfied (use --upgrade to upgrade): pbr>=0.11 in ./virtualenv/lib/python2.7/site-packages (from mock->teuthology==1.0.0)
Requirement already satisfied (use --upgrade to upgrade): jinja2 in ./virtualenv/lib/python2.7/site-packages (from ansible>=2.0->teuthology==1.0.0)
Requirement already satisfied (use --upgrade to upgrade): cryptography>=0.7 in ./virtualenv/lib/python2.7/site-packages (from pyopenssl>=0.13->teuthology==1.0.0)
Requirement already satisfied (use --upgrade to upgrade): MarkupSafe in ./virtualenv/lib/python2.7/site-packages (from jinja2->ansible>=2.0->teuthology==1.0.0)
Requirement already satisfied (use --upgrade to upgrade): idna>=2.0 in ./virtualenv/lib/python2.7/site-packages (from cryptography>=0.7->pyopenssl>=0.13->teuthology==1.0.0)
Requirement already satisfied (use --upgrade to upgrade): ipaddress in ./virtualenv/lib/python2.7/site-packages (from cryptography>=0.7->pyopenssl>=0.13->teuthology==1.0.0)
Requirement already satisfied (use --upgrade to upgrade): enum34 in ./virtualenv/lib/python2.7/site-packages (from cryptography>=0.7->pyopenssl>=0.13->teuthology==1.0.0)
Requirement already satisfied (use --upgrade to upgrade): cffi>=1.4.1 in ./virtualenv/lib/python2.7/site-packages (from cryptography>=0.7->pyopenssl>=0.13->teuthology==1.0.0)
Requirement already satisfied (use --upgrade to upgrade): pycparser in ./virtualenv/lib/python2.7/site-packages (from cffi>=1.4.1->cryptography>=0.7->pyopenssl>=0.13->teuthology==1.0.0)
Installing collected packages: fudge, manhole, teuthology
  Running setup.py install for fudge: started
    Running setup.py install for fudge: finished with status 'done'
  Running setup.py develop for teuthology
Successfully installed fudge-1.1.0 manhole-1.3.0 teuthology
You are using pip version 8.1.2, however version 9.0.1 is available.
You should consider upgrading via the 'pip install --upgrade pip' command.
++ pip install -e .
Obtaining file:///home/gitlab-runner/builds/9120dac4/0/root/ceph-workbench
Requirement already satisfied (use --upgrade to upgrade): alabaster==0.7.7 in ./virtualenv/lib/python2.7/site-packages (from ceph-workbench==1.5.15.dev3)
Requirement already satisfied (use --upgrade to upgrade): ansible==2.1.1.0 in ./virtualenv/lib/python2.7/site-packages (from ceph-workbench==1.5.15.dev3)
Requirement already satisfied (use --upgrade to upgrade): appdirs==1.4.0 in ./virtualenv/lib/python2.7/site-packages (from ceph-workbench==1.5.15.dev3)
Requirement already satisfied (use --upgrade to upgrade): Babel==2.3.4 in ./virtualenv/lib/python2.7/site-packages (from ceph-workbench==1.5.15.dev3)
Requirement already satisfied (use --upgrade to upgrade): beanstalkc==0.4.0 in ./virtualenv/lib/python2.7/site-packages (from ceph-workbench==1.5.15.dev3)
Requirement already satisfied (use --upgrade to upgrade): boto==2.39.0 in ./virtualenv/lib/python2.7/site-packages (from ceph-workbench==1.5.15.dev3)
Requirement already satisfied (use --upgrade to upgrade): bunch==1.0.1 in ./virtualenv/lib/python2.7/site-packages (from ceph-workbench==1.5.15.dev3)
Requirement already satisfied (use --upgrade to upgrade): cffi==1.5.2 in ./virtualenv/lib/python2.7/site-packages (from ceph-workbench==1.5.15.dev3)
Requirement already satisfied (use --upgrade to upgrade): cliff==2.2.0 in ./virtualenv/lib/python2.7/site-packages (from ceph-workbench==1.5.15.dev3)
Requirement already satisfied (use --upgrade to upgrade): cmd2==0.6.8 in ./virtualenv/lib/python2.7/site-packages (from ceph-workbench==1.5.15.dev3)
Requirement already satisfied (use --upgrade to upgrade): configobj==5.0.6 in ./virtualenv/lib/python2.7/site-packages (from ceph-workbench==1.5.15.dev3)
Requirement already satisfied (use --upgrade to upgrade): configparser==3.3.0.post2 in ./virtualenv/lib/python2.7/site-packages (from ceph-workbench==1.5.15.dev3)
Requirement already satisfied (use --upgrade to upgrade): contextlib2==0.5.1 in ./virtualenv/lib/python2.7/site-packages (from ceph-workbench==1.5.15.dev3)
Requirement already satisfied (use --upgrade to upgrade): coverage==4.0.3 in ./virtualenv/lib/python2.7/site-packages (from ceph-workbench==1.5.15.dev3)
Requirement already satisfied (use --upgrade to upgrade): cryptography==1.3 in ./virtualenv/lib/python2.7/site-packages (from ceph-workbench==1.5.15.dev3)
Requirement already satisfied (use --upgrade to upgrade): d2to1==0.2.12.post1 in ./virtualenv/lib/python2.7/site-packages (from ceph-workbench==1.5.15.dev3)
Requirement already satisfied (use --upgrade to upgrade): debtcollector==1.8.0 in ./virtualenv/lib/python2.7/site-packages (from ceph-workbench==1.5.15.dev3)
Requirement already satisfied (use --upgrade to upgrade): discover==0.4.0 in ./virtualenv/lib/python2.7/site-packages (from ceph-workbench==1.5.15.dev3)
Requirement already satisfied (use --upgrade to upgrade): docopt==0.6.2 in ./virtualenv/lib/python2.7/site-packages (from ceph-workbench==1.5.15.dev3)
Requirement already satisfied (use --upgrade to upgrade): docutils==0.12 in ./virtualenv/lib/python2.7/site-packages (from ceph-workbench==1.5.15.dev3)
Requirement already satisfied (use --upgrade to upgrade): ecdsa==0.13 in ./virtualenv/lib/python2.7/site-packages (from ceph-workbench==1.5.15.dev3)
Requirement already satisfied (use --upgrade to upgrade): enum34==1.1.2 in ./virtualenv/lib/python2.7/site-packages (from ceph-workbench==1.5.15.dev3)
Requirement already satisfied (use --upgrade to upgrade): extras==0.0.3 in ./virtualenv/lib/python2.7/site-packages (from ceph-workbench==1.5.15.dev3)
Requirement already satisfied (use --upgrade to upgrade): fixtures==1.4.0 in ./virtualenv/lib/python2.7/site-packages (from ceph-workbench==1.5.15.dev3)
Requirement already satisfied (use --upgrade to upgrade): flake8==2.2.4 in ./virtualenv/lib/python2.7/site-packages (from ceph-workbench==1.5.15.dev3)
Requirement already satisfied (use --upgrade to upgrade): funcsigs==1.0.2 in ./virtualenv/lib/python2.7/site-packages (from ceph-workbench==1.5.15.dev3)
Requirement already satisfied (use --upgrade to upgrade): functools32==3.2.3.post2 in ./virtualenv/lib/python2.7/site-packages (from ceph-workbench==1.5.15.dev3)
Requirement already satisfied (use --upgrade to upgrade): gevent==1.0.2 in ./virtualenv/lib/python2.7/site-packages (from ceph-workbench==1.5.15.dev3)
Requirement already satisfied (use --upgrade to upgrade): gitdb==0.6.4 in ./virtualenv/lib/python2.7/site-packages (from ceph-workbench==1.5.15.dev3)
Requirement already satisfied (use --upgrade to upgrade): github2gitlab==1.5.5 in ./virtualenv/lib/python2.7/site-packages (from ceph-workbench==1.5.15.dev3)
Requirement already satisfied (use --upgrade to upgrade): githubpy==1.1.0 in ./virtualenv/lib/python2.7/site-packages (from ceph-workbench==1.5.15.dev3)
Requirement already satisfied (use --upgrade to upgrade): GitPython==1.0.2 in ./virtualenv/lib/python2.7/site-packages (from ceph-workbench==1.5.15.dev3)
Requirement already satisfied (use --upgrade to upgrade): greenlet==0.4.9 in ./virtualenv/lib/python2.7/site-packages (from ceph-workbench==1.5.15.dev3)
Requirement already satisfied (use --upgrade to upgrade): hacking==0.10.2 in ./virtualenv/lib/python2.7/site-packages (from ceph-workbench==1.5.15.dev3)
Requirement already satisfied (use --upgrade to upgrade): httplib2==0.9.2 in ./virtualenv/lib/python2.7/site-packages (from ceph-workbench==1.5.15.dev3)
Requirement already satisfied (use --upgrade to upgrade): idna==2.0 in ./virtualenv/lib/python2.7/site-packages (from ceph-workbench==1.5.15.dev3)
Requirement already satisfied (use --upgrade to upgrade): ipaddress==1.0.16 in ./virtualenv/lib/python2.7/site-packages (from ceph-workbench==1.5.15.dev3)
Requirement already satisfied (use --upgrade to upgrade): iso8601==0.1.11 in ./virtualenv/lib/python2.7/site-packages (from ceph-workbench==1.5.15.dev3)
Requirement already satisfied (use --upgrade to upgrade): Jinja2==2.8 in ./virtualenv/lib/python2.7/site-packages (from ceph-workbench==1.5.15.dev3)
Requirement already satisfied (use --upgrade to upgrade): jsonpatch==1.14 in ./virtualenv/lib/python2.7/site-packages (from ceph-workbench==1.5.15.dev3)
Requirement already satisfied (use --upgrade to upgrade): jsonpointer==1.10 in ./virtualenv/lib/python2.7/site-packages (from ceph-workbench==1.5.15.dev3)
Requirement already satisfied (use --upgrade to upgrade): jsonschema==2.5.1 in ./virtualenv/lib/python2.7/site-packages (from ceph-workbench==1.5.15.dev3)
Requirement already satisfied (use --upgrade to upgrade): keystoneauth1==2.12.1 in ./virtualenv/lib/python2.7/site-packages (from ceph-workbench==1.5.15.dev3)
Requirement already satisfied (use --upgrade to upgrade): linecache2==1.0.0 in ./virtualenv/lib/python2.7/site-packages (from ceph-workbench==1.5.15.dev3)
Requirement already satisfied (use --upgrade to upgrade): MarkupSafe==0.23 in ./virtualenv/lib/python2.7/site-packages (from ceph-workbench==1.5.15.dev3)
Requirement already satisfied (use --upgrade to upgrade): mccabe==0.2.1 in ./virtualenv/lib/python2.7/site-packages (from ceph-workbench==1.5.15.dev3)
Requirement already satisfied (use --upgrade to upgrade): mock==1.3.0 in ./virtualenv/lib/python2.7/site-packages (from ceph-workbench==1.5.15.dev3)
Requirement already satisfied (use --upgrade to upgrade): monotonic==1.2 in ./virtualenv/lib/python2.7/site-packages (from ceph-workbench==1.5.15.dev3)
Requirement already satisfied (use --upgrade to upgrade): msgpack-python==0.4.8 in ./virtualenv/lib/python2.7/site-packages (from ceph-workbench==1.5.15.dev3)
Requirement already satisfied (use --upgrade to upgrade): MySQL-python==1.2.3 in ./virtualenv/lib/python2.7/site-packages (from ceph-workbench==1.5.15.dev3)
Requirement already satisfied (use --upgrade to upgrade): mysqlclient==1.3.7 in ./virtualenv/lib/python2.7/site-packages (from ceph-workbench==1.5.15.dev3)
Requirement already satisfied (use --upgrade to upgrade): ndg-httpsclient==0.4.0 in ./virtualenv/lib/python2.7/site-packages (from ceph-workbench==1.5.15.dev3)
Requirement already satisfied (use --upgrade to upgrade): netaddr==0.7.18 in ./virtualenv/lib/python2.7/site-packages (from ceph-workbench==1.5.15.dev3)
Requirement already satisfied (use --upgrade to upgrade): netifaces==0.10.5 in ./virtualenv/lib/python2.7/site-packages (from ceph-workbench==1.5.15.dev3)
Requirement already satisfied (use --upgrade to upgrade): openstacksdk==0.9.5 in ./virtualenv/lib/python2.7/site-packages (from ceph-workbench==1.5.15.dev3)
Requirement already satisfied (use --upgrade to upgrade): os-client-config==1.21.1 in ./virtualenv/lib/python2.7/site-packages (from ceph-workbench==1.5.15.dev3)
Requirement already satisfied (use --upgrade to upgrade): osc-lib==1.1.0 in ./virtualenv/lib/python2.7/site-packages (from ceph-workbench==1.5.15.dev3)
Requirement already satisfied (use --upgrade to upgrade): oslo.config==3.17.0 in ./virtualenv/lib/python2.7/site-packages (from ceph-workbench==1.5.15.dev3)
Requirement already satisfied (use --upgrade to upgrade): oslo.i18n==3.9.0 in ./virtualenv/lib/python2.7/site-packages (from ceph-workbench==1.5.15.dev3)
Requirement already satisfied (use --upgrade to upgrade): oslo.serialization==2.13.0 in ./virtualenv/lib/python2.7/site-packages (from ceph-workbench==1.5.15.dev3)
Requirement already satisfied (use --upgrade to upgrade): oslo.utils==3.16.0 in ./virtualenv/lib/python2.7/site-packages (from ceph-workbench==1.5.15.dev3)
Requirement already satisfied (use --upgrade to upgrade): paramiko==1.16.0 in ./virtualenv/lib/python2.7/site-packages (from ceph-workbench==1.5.15.dev3)
Requirement already satisfied (use --upgrade to upgrade): pbr==1.10.0 in ./virtualenv/lib/python2.7/site-packages (from ceph-workbench==1.5.15.dev3)
Requirement already satisfied (use --upgrade to upgrade): pep8==1.5.7 in ./virtualenv/lib/python2.7/site-packages (from ceph-workbench==1.5.15.dev3)
Requirement already satisfied (use --upgrade to upgrade): pexpect==4.0.1 in ./virtualenv/lib/python2.7/site-packages (from ceph-workbench==1.5.15.dev3)
Requirement already satisfied (use --upgrade to upgrade): pip==8.1.2 in ./virtualenv/lib/python2.7/site-packages (from ceph-workbench==1.5.15.dev3)
Requirement already satisfied (use --upgrade to upgrade): pluggy==0.3.1 in ./virtualenv/lib/python2.7/site-packages (from ceph-workbench==1.5.15.dev3)
Requirement already satisfied (use --upgrade to upgrade): positional==1.1.1 in ./virtualenv/lib/python2.7/site-packages (from ceph-workbench==1.5.15.dev3)
Requirement already satisfied (use --upgrade to upgrade): prettytable==0.7.2 in ./virtualenv/lib/python2.7/site-packages (from ceph-workbench==1.5.15.dev3)
Requirement already satisfied (use --upgrade to upgrade): psutil==4.1.0 in ./virtualenv/lib/python2.7/site-packages (from ceph-workbench==1.5.15.dev3)
Requirement already satisfied (use --upgrade to upgrade): ptyprocess==0.5.1 in ./virtualenv/lib/python2.7/site-packages (from ceph-workbench==1.5.15.dev3)
Requirement already satisfied (use --upgrade to upgrade): py==1.4.31 in ./virtualenv/lib/python2.7/site-packages (from ceph-workbench==1.5.15.dev3)
Requirement already satisfied (use --upgrade to upgrade): pyasn1==0.1.9 in ./virtualenv/lib/python2.7/site-packages (from ceph-workbench==1.5.15.dev3)
Requirement already satisfied (use --upgrade to upgrade): pycparser==2.14 in ./virtualenv/lib/python2.7/site-packages (from ceph-workbench==1.5.15.dev3)
Requirement already satisfied (use --upgrade to upgrade): pycrypto==2.6.1 in ./virtualenv/lib/python2.7/site-packages (from ceph-workbench==1.5.15.dev3)
Requirement already satisfied (use --upgrade to upgrade): pyflakes==0.8.1 in ./virtualenv/lib/python2.7/site-packages (from ceph-workbench==1.5.15.dev3)
Requirement already satisfied (use --upgrade to upgrade): Pygments==2.1.3 in ./virtualenv/lib/python2.7/site-packages (from ceph-workbench==1.5.15.dev3)
Requirement already satisfied (use --upgrade to upgrade): pyOpenSSL==0.15.1 in ./virtualenv/lib/python2.7/site-packages (from ceph-workbench==1.5.15.dev3)
Requirement already satisfied (use --upgrade to upgrade): pyparsing==2.1.8 in ./virtualenv/lib/python2.7/site-packages (from ceph-workbench==1.5.15.dev3)
Requirement already satisfied (use --upgrade to upgrade): pyrsistent==0.11.12 in ./virtualenv/lib/python2.7/site-packages (from ceph-workbench==1.5.15.dev3)
Requirement already satisfied (use --upgrade to upgrade): pytest==2.9.0 in ./virtualenv/lib/python2.7/site-packages (from ceph-workbench==1.5.15.dev3)
Requirement already satisfied (use --upgrade to upgrade): pytest-capturelog==0.7 in ./virtualenv/lib/python2.7/site-packages (from ceph-workbench==1.5.15.dev3)
Requirement already satisfied (use --upgrade to upgrade): python-cinderclient==1.9.0 in ./virtualenv/lib/python2.7/site-packages (from ceph-workbench==1.5.15.dev3)
Requirement already satisfied (use --upgrade to upgrade): python-dateutil==2.5.3 in ./virtualenv/lib/python2.7/site-packages (from ceph-workbench==1.5.15.dev3)
Requirement already satisfied (use --upgrade to upgrade): python-glanceclient==2.5.0 in ./virtualenv/lib/python2.7/site-packages (from ceph-workbench==1.5.15.dev3)
Requirement already satisfied (use --upgrade to upgrade): python-keystoneclient==3.5.0 in ./virtualenv/lib/python2.7/site-packages (from ceph-workbench==1.5.15.dev3)
Requirement already satisfied (use --upgrade to upgrade): python-mimeparse==1.5.1 in ./virtualenv/lib/python2.7/site-packages (from ceph-workbench==1.5.15.dev3)
Requirement already satisfied (use --upgrade to upgrade): python-neutronclient==4.1.1 in ./virtualenv/lib/python2.7/site-packages (from ceph-workbench==1.5.15.dev3)
Requirement already satisfied (use --upgrade to upgrade): python-novaclient==6.0.0 in ./virtualenv/lib/python2.7/site-packages (from ceph-workbench==1.5.15.dev3)
Requirement already satisfied (use --upgrade to upgrade): python-openstackclient==3.2.0 in ./virtualenv/lib/python2.7/site-packages (from ceph-workbench==1.5.15.dev3)
Requirement already satisfied (use --upgrade to upgrade): python-redmine==1.5.0 in ./virtualenv/lib/python2.7/site-packages (from ceph-workbench==1.5.15.dev3)
Requirement already satisfied (use --upgrade to upgrade): python-subunit==1.2.0 in ./virtualenv/lib/python2.7/site-packages (from ceph-workbench==1.5.15.dev3)
Requirement already satisfied (use --upgrade to upgrade): pytz==2016.6.1 in ./virtualenv/lib/python2.7/site-packages (from ceph-workbench==1.5.15.dev3)
Requirement already satisfied (use --upgrade to upgrade): PyYAML==3.12 in ./virtualenv/lib/python2.7/site-packages (from ceph-workbench==1.5.15.dev3)
Requirement already satisfied (use --upgrade to upgrade): raven==5.11.1 in ./virtualenv/lib/python2.7/site-packages (from ceph-workbench==1.5.15.dev3)
Requirement already satisfied (use --upgrade to upgrade): requests==2.11.1 in ./virtualenv/lib/python2.7/site-packages (from ceph-workbench==1.5.15.dev3)
Requirement already satisfied (use --upgrade to upgrade): requestsexceptions==1.1.3 in ./virtualenv/lib/python2.7/site-packages (from ceph-workbench==1.5.15.dev3)
Requirement already satisfied (use --upgrade to upgrade): setuptools==20.3.1 in ./virtualenv/lib/python2.7/site-packages (from ceph-workbench==1.5.15.dev3)
Requirement already satisfied (use --upgrade to upgrade): simplejson==3.8.2 in ./virtualenv/lib/python2.7/site-packages (from ceph-workbench==1.5.15.dev3)
Requirement already satisfied (use --upgrade to upgrade): six==1.10.0 in ./virtualenv/lib/python2.7/site-packages (from ceph-workbench==1.5.15.dev3)
Requirement already satisfied (use --upgrade to upgrade): smmap==0.9.0 in ./virtualenv/lib/python2.7/site-packages (from ceph-workbench==1.5.15.dev3)
Requirement already satisfied (use --upgrade to upgrade): snowballstemmer==1.2.1 in ./virtualenv/lib/python2.7/site-packages (from ceph-workbench==1.5.15.dev3)
Requirement already satisfied (use --upgrade to upgrade): Sphinx==1.3.6 in ./virtualenv/lib/python2.7/site-packages (from ceph-workbench==1.5.15.dev3)
Requirement already satisfied (use --upgrade to upgrade): sphinx-rtd-theme==0.1.9 in ./virtualenv/lib/python2.7/site-packages (from ceph-workbench==1.5.15.dev3)
Requirement already satisfied (use --upgrade to upgrade): stevedore==1.17.1 in ./virtualenv/lib/python2.7/site-packages (from ceph-workbench==1.5.15.dev3)
Requirement already satisfied (use --upgrade to upgrade): testrepository==0.0.20 in ./virtualenv/lib/python2.7/site-packages (from ceph-workbench==1.5.15.dev3)
Requirement already satisfied (use --upgrade to upgrade): testtools==2.0.0 in ./virtualenv/lib/python2.7/site-packages (from ceph-workbench==1.5.15.dev3)
Requirement already satisfied (use --upgrade to upgrade): tox==2.3.1 in ./virtualenv/lib/python2.7/site-packages (from ceph-workbench==1.5.15.dev3)
Requirement already satisfied (use --upgrade to upgrade): traceback2==1.4.0 in ./virtualenv/lib/python2.7/site-packages (from ceph-workbench==1.5.15.dev3)
Requirement already satisfied (use --upgrade to upgrade): unicodecsv==0.14.1 in ./virtualenv/lib/python2.7/site-packages (from ceph-workbench==1.5.15.dev3)
Requirement already satisfied (use --upgrade to upgrade): unittest2==1.1.0 in ./virtualenv/lib/python2.7/site-packages (from ceph-workbench==1.5.15.dev3)
Requirement already satisfied (use --upgrade to upgrade): virtualenv==15.0.1 in ./virtualenv/lib/python2.7/site-packages (from ceph-workbench==1.5.15.dev3)
Requirement already satisfied (use --upgrade to upgrade): warlock==1.2.0 in ./virtualenv/lib/python2.7/site-packages (from ceph-workbench==1.5.15.dev3)
Requirement already satisfied (use --upgrade to upgrade): web.py==0.37 in ./virtualenv/lib/python2.7/site-packages (from ceph-workbench==1.5.15.dev3)
Requirement already satisfied (use --upgrade to upgrade): wrapt==1.10.8 in ./virtualenv/lib/python2.7/site-packages (from ceph-workbench==1.5.15.dev3)
Requirement already satisfied (use --upgrade to upgrade): rfc3986>=0.2.0 in ./virtualenv/lib/python2.7/site-packages (from oslo.config==3.17.0->ceph-workbench==1.5.15.dev3)
Requirement already satisfied (use --upgrade to upgrade): argparse in /usr/lib/python2.7 (from unittest2==1.1.0->ceph-workbench==1.5.15.dev3)
Installing collected packages: ceph-workbench
  Running setup.py develop for ceph-workbench
Successfully installed ceph-workbench
You are using pip version 8.1.2, however version 9.0.1 is available.
You should consider upgrading via the 'pip install --upgrade pip' command.
++ pip install tox
Requirement already satisfied (use --upgrade to upgrade): tox in ./virtualenv/lib/python2.7/site-packages
Requirement already satisfied (use --upgrade to upgrade): py>=1.4.17 in ./virtualenv/lib/python2.7/site-packages (from tox)
Requirement already satisfied (use --upgrade to upgrade): virtualenv>=1.11.2 in ./virtualenv/lib/python2.7/site-packages (from tox)
Requirement already satisfied (use --upgrade to upgrade): pluggy<0.4.0,>=0.3.0 in ./virtualenv/lib/python2.7/site-packages (from tox)
You are using pip version 8.1.2, however version 9.0.1 is available.
You should consider upgrading via the 'pip install --upgrade pip' command.
+ bash tests/setup.sh
+ bash tests/teardown.sh
Failed to stop container (test-gitlab): Error response from daemon: No such container: test-gitlab
Failed to remove container (test-gitlab): Error response from daemon: No such container: test-gitlab
Failed to stop container (test-mysql): Error response from daemon: No such container: test-mysql
Failed to remove container (test-mysql): Error response from daemon: No such container: test-mysql
Failed to stop container (test-redis): Error response from daemon: No such container: test-redis
Failed to remove container (test-redis): Error response from daemon: No such container: test-redis
Failed to stop container (postgresql-redmine): Error response from daemon: No such container: postgresql-redmine
Failed to remove container (postgresql-redmine): Error response from daemon: No such container: postgresql-redmine
Failed to stop container (redmine): Error response from daemon: No such container: redmine
Failed to remove container (redmine): Error response from daemon: No such container: redmine
+ mkdir data
+ bash tests/setup-redmine.sh
++ pwd
+ sudo docker run --name=postgresql-redmine -d --env=DB_NAME=redmine_production --env=DB_USER=redmine --env=DB_PASS=password --volume=/home/gitlab-runner/builds/9120dac4/0/root/ceph-workbench/data/postgresql:/var/lib/postgresql quay.io/sameersbn/postgresql:9.4-5
ba77e0b4b041ae390c7ad9ab0f994405b0658df2b731bb479e74bd1543230621
++ pwd
+ sudo docker run --name=redmine -d --link=postgresql-redmine:postgresql --publish=10080:80 --env=REDMINE_PORT=10080 --volume=/home/gitlab-runner/builds/9120dac4/0/root/ceph-workbench/data/redmine:/home/redmine/data quay.io/sameersbn/redmine:3.1.1-3
63f55d3da4633b2e04c21f351c2f650f173070315e75ca783cf70faea820a86d
+ success=false
+ for delay in 15 15 15 15 15 30 30 30 30 30 30 30 30 60 60 60 60 120 240 512
+ sleep 15
+ python tests/redmine-init.py http://127.0.0.1:10080 admin admin
Traceback (most recent call last):
  File "tests/redmine-init.py", line 74, in <module>
    init(*sys.argv[1:])
  File "tests/redmine-init.py", line 22, in init
    p = params(s.get(url + '/login'))
  File "/home/gitlab-runner/builds/9120dac4/0/root/ceph-workbench/virtualenv/local/lib/python2.7/site-packages/requests/sessions.py", line 488, in get
    return self.request('GET', url, **kwargs)
  File "/home/gitlab-runner/builds/9120dac4/0/root/ceph-workbench/virtualenv/local/lib/python2.7/site-packages/requests/sessions.py", line 475, in request
    resp = self.send(prep, **send_kwargs)
  File "/home/gitlab-runner/builds/9120dac4/0/root/ceph-workbench/virtualenv/local/lib/python2.7/site-packages/requests/sessions.py", line 596, in send
    r = adapter.send(request, **kwargs)
  File "/home/gitlab-runner/builds/9120dac4/0/root/ceph-workbench/virtualenv/local/lib/python2.7/site-packages/requests/adapters.py", line 473, in send
    raise ConnectionError(err, request=request)
requests.exceptions.ConnectionError: ('Connection aborted.', BadStatusLine("''",))
+ for delay in 15 15 15 15 15 30 30 30 30 30 30 30 30 60 60 60 60 120 240 512
+ sleep 15
+ python tests/redmine-init.py http://127.0.0.1:10080 admin admin
Traceback (most recent call last):
  File "tests/redmine-init.py", line 74, in <module>
    init(*sys.argv[1:])
  File "tests/redmine-init.py", line 22, in init
    p = params(s.get(url + '/login'))
  File "/home/gitlab-runner/builds/9120dac4/0/root/ceph-workbench/virtualenv/local/lib/python2.7/site-packages/requests/sessions.py", line 488, in get
    return self.request('GET', url, **kwargs)
  File "/home/gitlab-runner/builds/9120dac4/0/root/ceph-workbench/virtualenv/local/lib/python2.7/site-packages/requests/sessions.py", line 475, in request
    resp = self.send(prep, **send_kwargs)
  File "/home/gitlab-runner/builds/9120dac4/0/root/ceph-workbench/virtualenv/local/lib/python2.7/site-packages/requests/sessions.py", line 596, in send
    r = adapter.send(request, **kwargs)
  File "/home/gitlab-runner/builds/9120dac4/0/root/ceph-workbench/virtualenv/local/lib/python2.7/site-packages/requests/adapters.py", line 473, in send
    raise ConnectionError(err, request=request)
requests.exceptions.ConnectionError: ('Connection aborted.', error(104, 'Connection reset by peer'))
+ for delay in 15 15 15 15 15 30 30 30 30 30 30 30 30 60 60 60 60 120 240 512
+ sleep 15
+ python tests/redmine-init.py http://127.0.0.1:10080 admin admin
+ success=true
+ break
+ true
+ bash tests/setup-gitlab.sh
++ pwd
+ DATA=/home/gitlab-runner/builds/9120dac4/0/root/ceph-workbench/data
+ mkdir -p /home/gitlab-runner/builds/9120dac4/0/root/ceph-workbench/data
+ sudo docker run --name=test-redis -d sameersbn/redis:latest
9ad79ef97d81b30161843a369ee42261b505f90e7ef9a05971487556642d8453
+ sudo rm -fr /home/gitlab-runner/builds/9120dac4/0/root/ceph-workbench/data/mysql
+ mkdir -p /home/gitlab-runner/builds/9120dac4/0/root/ceph-workbench/data/mysql
+ sudo docker run --name=test-mysql -d -e DB_NAME=gitlabhq_production -e DB_USER=gitlab -e DB_PASS=Wrobyak4 -v /home/gitlab-runner/builds/9120dac4/0/root/ceph-workbench/data/mysql/data:/var/lib/mysql sameersbn/mysql:latest
107c1c1b9e393b3756a6ccc213f89319c4b8a15a11701255f139c7afc80ae148
+ sudo rm -fr /home/gitlab-runner/builds/9120dac4/0/root/ceph-workbench/data/gitlab
+ mkdir -p /home/gitlab-runner/builds/9120dac4/0/root/ceph-workbench/data/gitlab
++ which docker
+ sudo docker run --name=test-gitlab -it -d --link test-mysql:mysql --link test-redis:redisio -e GITLAB_SIGNUP=true -e GITLAB_PORT=80 -e GITLAB_HOST=localhost -e GITLAB_SSH_PORT=8022 -p 8022:22 -p 8181:80 -e GITLAB_SECRETS_DB_KEY_BASE=4W44tm7bJFRPWNMVzKngffxVWXRpVs49dxhFwgpx7FbCj3wXCMmsz47LzWsdr7nM -v /var/run/docker.sock:/run/docker.sock -v /home/gitlab-runner/builds/9120dac4/0/root/ceph-workbench/data/gitlab/data:/home/git/data -v /usr/bin/docker:/bin/docker sameersbn/gitlab
d78a98bbdd9ed342d5d4c75b4895806104830b60f2c82325c0600bf4b9ef1213
+ success=false
+ for delay in 15 15 15 15 15 30 30 30 30 30 30 30 30 60 60 60 60 120 240 512
+ sleep 15
+ wget -O - http://127.0.0.1:8181/users/sign_in
+ grep -q 'About GitLab'
--2017-02-08 14:13:19--  http://127.0.0.1:8181/users/sign_in
Connecting to 127.0.0.1:8181... connected.
HTTP request sent, awaiting response... Read error (Connection reset by peer) in headers.
Retrying.

--2017-02-08 14:13:20--  (try: 2)  http://127.0.0.1:8181/users/sign_in
Connecting to 127.0.0.1:8181... connected.
HTTP request sent, awaiting response... Read error (Connection reset by peer) in headers.
Retrying.

--2017-02-08 14:13:22--  (try: 3)  http://127.0.0.1:8181/users/sign_in
Connecting to 127.0.0.1:8181... connected.
HTTP request sent, awaiting response... No data received.
Retrying.

--2017-02-08 14:13:25--  (try: 4)  http://127.0.0.1:8181/users/sign_in
Connecting to 127.0.0.1:8181... connected.
HTTP request sent, awaiting response... No data received.
Retrying.

--2017-02-08 14:13:29--  (try: 5)  http://127.0.0.1:8181/users/sign_in
Connecting to 127.0.0.1:8181... connected.
HTTP request sent, awaiting response... No data received.
Retrying.

--2017-02-08 14:13:35--  (try: 6)  http://127.0.0.1:8181/users/sign_in
Connecting to 127.0.0.1:8181... connected.
HTTP request sent, awaiting response... No data received.
Retrying.

--2017-02-08 14:13:41--  (try: 7)  http://127.0.0.1:8181/users/sign_in
Connecting to 127.0.0.1:8181... connected.
HTTP request sent, awaiting response... Read error (Connection reset by peer) in headers.
Retrying.

--2017-02-08 14:13:48--  (try: 8)  http://127.0.0.1:8181/users/sign_in
Connecting to 127.0.0.1:8181... connected.
HTTP request sent, awaiting response... Read error (Connection reset by peer) in headers.
Retrying.

--2017-02-08 14:13:56--  (try: 9)  http://127.0.0.1:8181/users/sign_in
Connecting to 127.0.0.1:8181... connected.
HTTP request sent, awaiting response... Read error (Connection reset by peer) in headers.
Retrying.

--2017-02-08 14:14:05--  (try:10)  http://127.0.0.1:8181/users/sign_in
Connecting to 127.0.0.1:8181... connected.
HTTP request sent, awaiting response... No data received.
Retrying.

--2017-02-08 14:14:15--  (try:11)  http://127.0.0.1:8181/users/sign_in
Connecting to 127.0.0.1:8181... connected.
HTTP request sent, awaiting response... No data received.
Retrying.

--2017-02-08 14:14:25--  (try:12)  http://127.0.0.1:8181/users/sign_in
Connecting to 127.0.0.1:8181... connected.
HTTP request sent, awaiting response... No data received.
Retrying.

--2017-02-08 14:14:35--  (try:13)  http://127.0.0.1:8181/users/sign_in
Connecting to 127.0.0.1:8181... connected.
HTTP request sent, awaiting response... No data received.
Retrying.

--2017-02-08 14:14:45--  (try:14)  http://127.0.0.1:8181/users/sign_in
Connecting to 127.0.0.1:8181... connected.
HTTP request sent, awaiting response... Read error (Connection reset by peer) in headers.
Retrying.

--2017-02-08 14:14:55--  (try:15)  http://127.0.0.1:8181/users/sign_in
Connecting to 127.0.0.1:8181... connected.
HTTP request sent, awaiting response... 502 Bad Gateway
2017-02-08 14:14:55 ERROR 502: Bad Gateway.

+ for delay in 15 15 15 15 15 30 30 30 30 30 30 30 30 60 60 60 60 120 240 512
+ sleep 15
+ wget -O - http://127.0.0.1:8181/users/sign_in
+ grep -q 'About GitLab'
--2017-02-08 14:15:10--  http://127.0.0.1:8181/users/sign_in
Connecting to 127.0.0.1:8181... connected.
HTTP request sent, awaiting response... 502 Bad Gateway
2017-02-08 14:15:10 ERROR 502: Bad Gateway.

+ for delay in 15 15 15 15 15 30 30 30 30 30 30 30 30 60 60 60 60 120 240 512
+ sleep 15
+ wget -O - http://127.0.0.1:8181/users/sign_in
+ grep -q 'About GitLab'
--2017-02-08 14:15:25--  http://127.0.0.1:8181/users/sign_in
Connecting to 127.0.0.1:8181... connected.
HTTP request sent, awaiting response... 200 OK
Length: unspecified [text/html]
Saving to: ‘STDOUT’

     0K .......                                                3.04M=0.002s

2017-02-08 14:15:26 (3.04 MB/s) - written to stdout [7472]

+ success=true
+ break
+ true
+ tox
flake8 create: /home/gitlab-runner/builds/9120dac4/0/root/ceph-workbench/.tox/flake8
flake8 installdeps: -r/home/gitlab-runner/builds/9120dac4/0/root/ceph-workbench/requirements.txt
flake8 develop-inst: /home/gitlab-runner/builds/9120dac4/0/root/ceph-workbench
flake8 installed: You are using pip version 8.1.2, however version 9.0.1 is available.,You should consider upgrading via the 'pip install --upgrade pip' command.,alabaster==0.7.7,ansible==2.1.1.0,appdirs==1.4.0,Babel==2.3.4,beanstalkc==0.4.0,boto==2.39.0,bunch==1.0.1,-e git+http://gitlab-ci-token:xxxxxx@ceph-workbench.dachary.org/root/ceph-workbench.git@da20091d0047467b1dd69690cf27a9363e3a3494#egg=ceph_workbench,cffi==1.5.2,cliff==2.2.0,cmd2==0.6.8,configobj==5.0.6,configparser==3.3.0.post2,contextlib2==0.5.1,coverage==4.0.3,cryptography==1.3,d2to1==0.2.12.post1,debtcollector==1.8.0,discover==0.4.0,docopt==0.6.2,docutils==0.12,ecdsa==0.13,enum34==1.1.2,extras==0.0.3,fixtures==1.4.0,flake8==2.2.4,funcsigs==1.0.2,functools32==3.2.3.post2,gevent==1.0.2,gitdb==0.6.4,github2gitlab==1.5.5,githubpy==1.1.0,GitPython==1.0.2,greenlet==0.4.9,hacking==0.10.2,httplib2==0.9.2,idna==2.0,ipaddress==1.0.16,iso8601==0.1.11,Jinja2==2.8,jsonpatch==1.14,jsonpointer==1.10,jsonschema==2.5.1,keystoneauth1==2.12.1,linecache2==1.0.0,MarkupSafe==0.23,mccabe==0.2.1,mock==1.3.0,monotonic==1.2,msgpack-python==0.4.8,MySQL-python==1.2.3,mysqlclient==1.3.7,ndg-httpsclient==0.4.0,netaddr==0.7.18,netifaces==0.10.5,openstacksdk==0.9.5,os-client-config==1.21.1,osc-lib==1.1.0,oslo.config==3.17.0,oslo.i18n==3.9.0,oslo.serialization==2.13.0,oslo.utils==3.16.0,packaging==16.8,paramiko==1.16.0,pbr==1.10.0,pep8==1.5.7,pexpect==4.0.1,pluggy==0.3.1,positional==1.1.1,prettytable==0.7.2,psutil==4.1.0,ptyprocess==0.5.1,py==1.4.31,pyasn1==0.1.9,pycparser==2.14,pycrypto==2.6.1,pyflakes==0.8.1,Pygments==2.1.3,pyOpenSSL==0.15.1,pyparsing==2.1.8,pyrsistent==0.11.12,pytest==2.9.0,pytest-capturelog==0.7,python-cinderclient==1.9.0,python-dateutil==2.5.3,python-glanceclient==2.5.0,python-keystoneclient==3.5.0,python-mimeparse==1.5.1,python-neutronclient==4.1.1,python-novaclient==6.0.0,python-openstackclient==3.2.0,python-redmine==1.5.0,python-subunit==1.2.0,pytz==2016.6.1,PyYAML==3.12,raven==5.11.1,requests==2.11.1,requestsexceptions==1.1.3,rfc3986==0.4.1,simplejson==3.8.2,six==1.10.0,smmap==0.9.0,snowballstemmer==1.2.1,Sphinx==1.3.6,sphinx-rtd-theme==0.1.9,stevedore==1.17.1,testrepository==0.0.20,testtools==2.0.0,teuthology==1.0.0,tox==2.3.1,traceback2==1.4.0,unicodecsv==0.14.1,unittest2==1.1.0,virtualenv==15.0.1,warlock==1.2.0,web.py==0.37,wrapt==1.10.8
flake8 runtests: PYTHONHASHSEED='1941694114'
flake8 runtests: commands[0] | flake8 --ignore=H105,H405 bin ceph_workbench tests
py27 create: /home/gitlab-runner/builds/9120dac4/0/root/ceph-workbench/.tox/py27
py27 installdeps: -r/home/gitlab-runner/builds/9120dac4/0/root/ceph-workbench/requirements.txt
py27 develop-inst: /home/gitlab-runner/builds/9120dac4/0/root/ceph-workbench
py27 installed: You are using pip version 8.1.2, however version 9.0.1 is available.,You should consider upgrading via the 'pip install --upgrade pip' command.,alabaster==0.7.7,ansible==2.1.1.0,appdirs==1.4.0,Babel==2.3.4,beanstalkc==0.4.0,boto==2.39.0,bunch==1.0.1,-e git+http://gitlab-ci-token:xxxxxx@ceph-workbench.dachary.org/root/ceph-workbench.git@da20091d0047467b1dd69690cf27a9363e3a3494#egg=ceph_workbench,cffi==1.5.2,cliff==2.2.0,cmd2==0.6.8,configobj==5.0.6,configparser==3.3.0.post2,contextlib2==0.5.1,coverage==4.0.3,cryptography==1.3,d2to1==0.2.12.post1,debtcollector==1.8.0,discover==0.4.0,docopt==0.6.2,docutils==0.12,ecdsa==0.13,enum34==1.1.2,extras==0.0.3,fixtures==1.4.0,flake8==2.2.4,funcsigs==1.0.2,functools32==3.2.3.post2,gevent==1.0.2,gitdb==0.6.4,github2gitlab==1.5.5,githubpy==1.1.0,GitPython==1.0.2,greenlet==0.4.9,hacking==0.10.2,httplib2==0.9.2,idna==2.0,ipaddress==1.0.16,iso8601==0.1.11,Jinja2==2.8,jsonpatch==1.14,jsonpointer==1.10,jsonschema==2.5.1,keystoneauth1==2.12.1,linecache2==1.0.0,MarkupSafe==0.23,mccabe==0.2.1,mock==1.3.0,monotonic==1.2,msgpack-python==0.4.8,MySQL-python==1.2.3,mysqlclient==1.3.7,ndg-httpsclient==0.4.0,netaddr==0.7.18,netifaces==0.10.5,openstacksdk==0.9.5,os-client-config==1.21.1,osc-lib==1.1.0,oslo.config==3.17.0,oslo.i18n==3.9.0,oslo.serialization==2.13.0,oslo.utils==3.16.0,packaging==16.8,paramiko==1.16.0,pbr==1.10.0,pep8==1.5.7,pexpect==4.0.1,pluggy==0.3.1,positional==1.1.1,prettytable==0.7.2,psutil==4.1.0,ptyprocess==0.5.1,py==1.4.31,pyasn1==0.1.9,pycparser==2.14,pycrypto==2.6.1,pyflakes==0.8.1,Pygments==2.1.3,pyOpenSSL==0.15.1,pyparsing==2.1.8,pyrsistent==0.11.12,pytest==2.9.0,pytest-capturelog==0.7,python-cinderclient==1.9.0,python-dateutil==2.5.3,python-glanceclient==2.5.0,python-keystoneclient==3.5.0,python-mimeparse==1.5.1,python-neutronclient==4.1.1,python-novaclient==6.0.0,python-openstackclient==3.2.0,python-redmine==1.5.0,python-subunit==1.2.0,pytz==2016.6.1,PyYAML==3.12,raven==5.11.1,requests==2.11.1,requestsexceptions==1.1.3,rfc3986==0.4.1,simplejson==3.8.2,six==1.10.0,smmap==0.9.0,snowballstemmer==1.2.1,Sphinx==1.3.6,sphinx-rtd-theme==0.1.9,stevedore==1.17.1,testrepository==0.0.20,testtools==2.0.0,teuthology==1.0.0,tox==2.3.1,traceback2==1.4.0,unicodecsv==0.14.1,unittest2==1.1.0,virtualenv==15.0.1,warlock==1.2.0,web.py==0.37,wrapt==1.10.8
py27 runtests: PYTHONHASHSEED='1941694114'
py27 runtests: commands[0] | env PATH=/home/gitlab-runner/builds/9120dac4/0/root/ceph-workbench/teuthology/virtualenv/bin:/home/gitlab-runner/builds/9120dac4/0/root/ceph-workbench/virtualenv/bin:/usr/local/bin:/usr/bin:/bin:/usr/local/games:/usr/games /home/gitlab-runner/builds/9120dac4/0/root/ceph-workbench/.tox/py27/bin/coverage run --source=ceph_workbench /home/gitlab-runner/builds/9120dac4/0/root/ceph-workbench/.tox/py27/bin/py.test -v tests
============================= test session starts ==============================
platform linux2 -- Python 2.7.6, pytest-2.9.0, py-1.4.31, pluggy-0.3.1 -- /home/gitlab-runner/builds/9120dac4/0/root/ceph-workbench/.tox/py27/bin/python2.7
cachedir: .cache
rootdir: /home/gitlab-runner/builds/9120dac4/0/root/ceph-workbench, inifile: 
plugins: capturelog-0.7
collecting ... collected 40 items / 4 errors

tests/test_util.py::TestUtil::test_releases PASSED
tests/test_util.py::TestUtil::test_get_parser PASSED
tests/test_util.py::TestUtil::test_config_dir PASSED
tests/test_util.py::TestUtil::test_sh PASSED
tests/test_util.py::TestUtil::test_sh_progress PASSED
tests/test_util.py::TestUtil::test_sh_input PASSED
tests/test_util.py::TestUtil::test_sh_fail PASSED
tests/test_wbbackport.py::TestWBBackport::test_inventory_isolated_commit PASSED
tests/test_wbbackport.py::TestWBBackport::test_inventory_issues_no_merge_request PASSED
tests/test_wbbackport.py::TestWBBackport::test_inventory_issues_via_cherry_picking PASSED
tests/test_wbbackport.py::TestWBBackport::test_inventory_write PASSED
tests/test_wbbackportcreateissue.py::TestWBBackportCreateIssue::test_run PASSED
tests/test_wbbackportcreateissue.py::TestWBBackportCreateIssue::test_create_issue PASSED
tests/test_wbbackportsetrelease.py::TestWBBackportSetRelease::test_run PASSED
tests/test_wbbackportsetrelease.py::TestWBBackportSetRelease::test_set_release PASSED
tests/test_wbgit.py::TestWBRepo::test_update_release2ranges PASSED
tests/test_wbgit.py::TestWBRepo::test_remember_picked PASSED
tests/test_wbgit.py::TestWBRepo::test_remember_commits PASSED
tests/test_wbgit.py::TestWBRepo::test_update_commits PASSED
tests/test_wbgit.py::TestWBRepo::test_update_head2merge PASSED
tests/test_wbgit.py::TestWBRepo::test_update_release2backports PASSED
tests/test_wbgit.py::TestWBRepo::test_update_release2last_tag PASSED
tests/test_wbgit.py::TestWBRepo::test_clone PASSED
tests/test_wbgithub.py::TestWBGitHub::test_index PASSED
tests/test_wbgithub.py::TestWBGitHub::test_pull_request PASSED
tests/test_wbgitlab.py::TestWBGitLab::test_index PASSED
tests/test_wbredmine.py::TestWBRedmine::test_load_open_issues PASSED
tests/test_wbredmine.py::TestWBRedmine::test_set_custom_fields PASSED
tests/test_wbredmine.py::TestWBRedmine::test_index PASSED
tests/test_wbredmine.py::TestWBRedmine::test_key PASSED
tests/test_wbredmine.py::TestWBRedmine::test_factory PASSED
tests/test_wbxref.py::TestWBXref::test_init PASSED
tests/test_wbxref.py::TestWBXref::test_merge_message2issue PASSED
tests/test_wbxref.py::TestWBXref::test_message2issue PASSED
tests/test_wbxref.py::TestWBXref::test_sanity_checks PASSED
tests/test_wbxref.py::TestWBXref::test_update_cherry_pick_or_link PASSED
tests/test_wbxref.py::TestWBXref::test_update_commit2issues PASSED
tests/test_wbxref.py::TestWBXref::test_update_issue PASSED
tests/test_wbxref.py::TestWBXref::test_update_issues_with_comments PASSED
tests/test_wbxref.py::TestWBXref::test_update_issues_with_merge PASSED

==================================== ERRORS ====================================
_________________ ERROR collecting tests/test_ceph_qa_suite.py _________________
tests/test_ceph_qa_suite.py:27: in <module>
    from ceph_workbench import ceph_qa_suite
ceph_workbench/ceph_qa_suite.py:20: in <module>
    from ceph_workbench.delegate import TeuthologyDelegate
ceph_workbench/delegate.py:26: in <module>
    from scripts import openstack
teuthology/scripts/openstack.py:4: in <module>
    import teuthology.openstack
teuthology/teuthology/__init__.py:9: in <module>
    import manhole
E   ImportError: No module named manhole
___________________ ERROR collecting tests/test_delegate.py ____________________
tests/test_delegate.py:30: in <module>
    from ceph_workbench import delegate
ceph_workbench/delegate.py:26: in <module>
    from scripts import openstack
teuthology/scripts/openstack.py:4: in <module>
    import teuthology.openstack
teuthology/teuthology/__init__.py:9: in <module>
    import manhole
E   ImportError: No module named manhole
_____________________ ERROR collecting tests/test_main.py ______________________
tests/test_main.py:23: in <module>
    from ceph_workbench import main
ceph_workbench/main.py:21: in <module>
    from ceph_workbench import ceph_qa_suite
ceph_workbench/ceph_qa_suite.py:20: in <module>
    from ceph_workbench.delegate import TeuthologyDelegate
ceph_workbench/delegate.py:26: in <module>
    from scripts import openstack
teuthology/scripts/openstack.py:4: in <module>
    import teuthology.openstack
teuthology/teuthology/__init__.py:9: in <module>
    import manhole
E   ImportError: No module named manhole
____________________ ERROR collecting tests/test_release.py ____________________
tests/test_release.py:60: in <module>
    from ceph_workbench import ceph_qa_suite
ceph_workbench/ceph_qa_suite.py:20: in <module>
    from ceph_workbench.delegate import TeuthologyDelegate
ceph_workbench/delegate.py:26: in <module>
    from scripts import openstack
teuthology/scripts/openstack.py:4: in <module>
    import teuthology.openstack
teuthology/teuthology/__init__.py:9: in <module>
    import manhole
E   ImportError: No module named manhole
=========== 40 passed, 1 pytest-warnings, 4 error in 912.36 seconds ============
ERROR: InvocationError: '/usr/bin/env PATH=/home/gitlab-runner/builds/9120dac4/0/root/ceph-workbench/teuthology/virtualenv/bin:/home/gitlab-runner/builds/9120dac4/0/root/ceph-workbench/virtualenv/bin:/usr/local/bin:/usr/bin:/bin:/usr/local/games:/usr/games /home/gitlab-runner/builds/9120dac4/0/root/ceph-workbench/.tox/py27/bin/coverage run --source=ceph_workbench /home/gitlab-runner/builds/9120dac4/0/root/ceph-workbench/.tox/py27/bin/py.test -v tests'
py3 create: /home/gitlab-runner/builds/9120dac4/0/root/ceph-workbench/.tox/py3
py3 installdeps: -r/home/gitlab-runner/builds/9120dac4/0/root/ceph-workbench/requirements.txt
py3 develop-inst: /home/gitlab-runner/builds/9120dac4/0/root/ceph-workbench
py3 installed: You are using pip version 8.1.2, however version 9.0.1 is available.,You should consider upgrading via the 'pip install --upgrade pip' command.,alabaster==0.7.7,ansible==2.1.1.0,appdirs==1.4.0,Babel==2.3.4,beanstalkc==0.4.0,boto==2.39.0,bunch==1.0.1,-e git+http://gitlab-ci-token:xxxxxx@ceph-workbench.dachary.org/root/ceph-workbench.git@da20091d0047467b1dd69690cf27a9363e3a3494#egg=ceph_workbench,cffi==1.5.2,cliff==2.2.0,cmd2==0.6.8,configobj==5.0.6,configparser==3.3.0.post2,contextlib2==0.5.1,coverage==4.0.3,cryptography==1.3,d2to1==0.2.12.post1,debtcollector==1.8.0,discover==0.4.0,docopt==0.6.2,docutils==0.12,ecdsa==0.13,enum34==1.1.2,extras==0.0.3,fixtures==1.4.0,flake8==2.2.4,funcsigs==1.0.2,functools32==3.2.3.post2,gevent==1.0.2,gitdb==0.6.4,github2gitlab==1.5.5,githubpy==1.1.0,GitPython==1.0.2,greenlet==0.4.9,hacking==0.10.2,httplib2==0.9.2,idna==2.0,ipaddress==1.0.16,iso8601==0.1.11,Jinja2==2.8,jsonpatch==1.14,jsonpointer==1.10,jsonschema==2.5.1,keystoneauth1==2.12.1,linecache2==1.0.0,MarkupSafe==0.23,mccabe==0.2.1,mock==1.3.0,monotonic==1.2,msgpack-python==0.4.8,MySQL-python==1.2.3,mysqlclient==1.3.7,ndg-httpsclient==0.4.0,netaddr==0.7.18,netifaces==0.10.5,openstacksdk==0.9.5,os-client-config==1.21.1,osc-lib==1.1.0,oslo.config==3.17.0,oslo.i18n==3.9.0,oslo.serialization==2.13.0,oslo.utils==3.16.0,packaging==16.8,paramiko==1.16.0,pbr==1.10.0,pep8==1.5.7,pexpect==4.0.1,pluggy==0.3.1,positional==1.1.1,prettytable==0.7.2,psutil==4.1.0,ptyprocess==0.5.1,py==1.4.31,pyasn1==0.1.9,pycparser==2.14,pycrypto==2.6.1,pyflakes==0.8.1,Pygments==2.1.3,pyOpenSSL==0.15.1,pyparsing==2.1.8,pyrsistent==0.11.12,pytest==2.9.0,pytest-capturelog==0.7,python-cinderclient==1.9.0,python-dateutil==2.5.3,python-glanceclient==2.5.0,python-keystoneclient==3.5.0,python-mimeparse==1.5.1,python-neutronclient==4.1.1,python-novaclient==6.0.0,python-openstackclient==3.2.0,python-redmine==1.5.0,python-subunit==1.2.0,pytz==2016.6.1,PyYAML==3.12,raven==5.11.1,requests==2.11.1,requestsexceptions==1.1.3,rfc3986==0.4.1,simplejson==3.8.2,six==1.10.0,smmap==0.9.0,snowballstemmer==1.2.1,Sphinx==1.3.6,sphinx-rtd-theme==0.1.9,stevedore==1.17.1,testrepository==0.0.20,testtools==2.0.0,teuthology==1.0.0,tox==2.3.1,traceback2==1.4.0,unicodecsv==0.14.1,unittest2==1.1.0,virtualenv==15.0.1,warlock==1.2.0,web.py==0.37,wrapt==1.10.8
py3 runtests: PYTHONHASHSEED='1941694114'
py3 runtests: commands[0] | env PATH=/home/gitlab-runner/builds/9120dac4/0/root/ceph-workbench/teuthology/virtualenv/bin:/home/gitlab-runner/builds/9120dac4/0/root/ceph-workbench/virtualenv/bin:/usr/local/bin:/usr/bin:/bin:/usr/local/games:/usr/games /home/gitlab-runner/builds/9120dac4/0/root/ceph-workbench/.tox/py3/bin/coverage run --source=ceph_workbench /home/gitlab-runner/builds/9120dac4/0/root/ceph-workbench/.tox/py3/bin/py.test -v tests
============================= test session starts ==============================
platform linux2 -- Python 2.7.6, pytest-2.9.0, py-1.4.31, pluggy-0.3.1 -- /home/gitlab-runner/builds/9120dac4/0/root/ceph-workbench/.tox/py3/bin/python
cachedir: .cache
rootdir: /home/gitlab-runner/builds/9120dac4/0/root/ceph-workbench, inifile: 
plugins: capturelog-0.7
collecting ... collected 40 items / 4 errors

tests/test_util.py::TestUtil::test_releases PASSED
tests/test_util.py::TestUtil::test_get_parser PASSED
tests/test_util.py::TestUtil::test_config_dir PASSED
tests/test_util.py::TestUtil::test_sh PASSED
tests/test_util.py::TestUtil::test_sh_progress PASSED
tests/test_util.py::TestUtil::test_sh_input PASSED
tests/test_util.py::TestUtil::test_sh_fail PASSED
tests/test_wbbackport.py::TestWBBackport::test_inventory_isolated_commit PASSED
tests/test_wbbackport.py::TestWBBackport::test_inventory_issues_no_merge_request PASSED
tests/test_wbbackport.py::TestWBBackport::test_inventory_issues_via_cherry_picking PASSED
tests/test_wbbackport.py::TestWBBackport::test_inventory_write PASSED
tests/test_wbbackportcreateissue.py::TestWBBackportCreateIssue::test_run PASSED
tests/test_wbbackportcreateissue.py::TestWBBackportCreateIssue::test_create_issue PASSED
tests/test_wbbackportsetrelease.py::TestWBBackportSetRelease::test_run PASSED
tests/test_wbbackportsetrelease.py::TestWBBackportSetRelease::test_run ERROR
tests/test_wbbackportsetrelease.py::TestWBBackportSetRelease::test_set_release ERROR
tests/test_wbgit.py::TestWBRepo::test_update_release2ranges PASSED
tests/test_wbgit.py::TestWBRepo::test_remember_picked PASSED
tests/test_wbgit.py::TestWBRepo::test_remember_commits PASSED
tests/test_wbgit.py::TestWBRepo::test_update_commits PASSED
tests/test_wbgit.py::TestWBRepo::test_update_head2merge PASSED
tests/test_wbgit.py::TestWBRepo::test_update_release2backports PASSED
tests/test_wbgit.py::TestWBRepo::test_update_release2last_tag PASSED
tests/test_wbgit.py::TestWBRepo::test_clone PASSED
tests/test_wbgithub.py::TestWBGitHub::test_index ERROR
tests/test_wbgithub.py::TestWBGitHub::test_pull_request ERROR
tests/test_wbgitlab.py::TestWBGitLab::test_index PASSED
tests/test_wbredmine.py::TestWBRedmine::test_load_open_issues PASSED
tests/test_wbredmine.py::TestWBRedmine::test_set_custom_fields PASSED
tests/test_wbredmine.py::TestWBRedmine::test_index PASSED
tests/test_wbredmine.py::TestWBRedmine::test_key PASSED
tests/test_wbredmine.py::TestWBRedmine::test_factory PASSED
tests/test_wbxref.py::TestWBXref::test_init PASSED
tests/test_wbxref.py::TestWBXref::test_merge_message2issue PASSED
tests/test_wbxref.py::TestWBXref::test_message2issue PASSED
tests/test_wbxref.py::TestWBXref::test_sanity_checks PASSED
tests/test_wbxref.py::TestWBXref::test_update_cherry_pick_or_link PASSED
tests/test_wbxref.py::TestWBXref::test_update_commit2issues PASSED
tests/test_wbxref.py::TestWBXref::test_update_issue PASSED
tests/test_wbxref.py::TestWBXref::test_update_issues_with_comments PASSED
tests/test_wbxref.py::TestWBXref::test_update_issues_with_merge PASSED

==================================== ERRORS ====================================
_________________ ERROR collecting tests/test_ceph_qa_suite.py _________________
tests/test_ceph_qa_suite.py:27: in <module>
    from ceph_workbench import ceph_qa_suite
ceph_workbench/ceph_qa_suite.py:20: in <module>
    from ceph_workbench.delegate import TeuthologyDelegate
ceph_workbench/delegate.py:26: in <module>
    from scripts import openstack
teuthology/scripts/openstack.py:4: in <module>
    import teuthology.openstack
teuthology/teuthology/__init__.py:9: in <module>
    import manhole
E   ImportError: No module named manhole
___________________ ERROR collecting tests/test_delegate.py ____________________
tests/test_delegate.py:30: in <module>
    from ceph_workbench import delegate
ceph_workbench/delegate.py:26: in <module>
    from scripts import openstack
teuthology/scripts/openstack.py:4: in <module>
    import teuthology.openstack
teuthology/teuthology/__init__.py:9: in <module>
    import manhole
E   ImportError: No module named manhole
_____________________ ERROR collecting tests/test_main.py ______________________
tests/test_main.py:23: in <module>
    from ceph_workbench import main
ceph_workbench/main.py:21: in <module>
    from ceph_workbench import ceph_qa_suite
ceph_workbench/ceph_qa_suite.py:20: in <module>
    from ceph_workbench.delegate import TeuthologyDelegate
ceph_workbench/delegate.py:26: in <module>
    from scripts import openstack
teuthology/scripts/openstack.py:4: in <module>
    import teuthology.openstack
teuthology/teuthology/__init__.py:9: in <module>
    import manhole
E   ImportError: No module named manhole
____________________ ERROR collecting tests/test_release.py ____________________
tests/test_release.py:60: in <module>
    from ceph_workbench import ceph_qa_suite
ceph_workbench/ceph_qa_suite.py:20: in <module>
    from ceph_workbench.delegate import TeuthologyDelegate
ceph_workbench/delegate.py:26: in <module>
    from scripts import openstack
teuthology/scripts/openstack.py:4: in <module>
    import teuthology.openstack
teuthology/teuthology/__init__.py:9: in <module>
    import manhole
E   ImportError: No module named manhole
____________ ERROR at teardown of TestWBBackportSetRelease.test_run ____________

self = <test_wbbackportsetrelease.TestWBBackportSetRelease object at 0x7f2a7c6620d0>

    def teardown(self):
        self.fixture_redmine.tearDown()
>       self.fixture_github.tearDown()

tests/test_wbbackportsetrelease.py:47: 
_ _ _ _ _ _ _ _ _ _ _ _ _ _ _ _ _ _ _ _ _ _ _ _ _ _ _ _ _ _ _ _ _ _ _ _ _ _ _ _ 
tests/fixture_github.py:55: in tearDown
    self.remove_project()
tests/fixture_github.py:85: in remove_project
    while self.project_exists(GITHUB['repo']):
_ _ _ _ _ _ _ _ _ _ _ _ _ _ _ _ _ _ _ _ _ _ _ _ _ _ _ _ _ _ _ _ _ _ _ _ _ _ _ _ 

self = <fixture_github.FixtureGitHub object at 0x7f2a7c662b90>
name = 'testrepo-41c507bb4b853e35dccc'

    def project_exists(self, name):
        retry = 10
        while retry > 0:
            try:
                for repo in self.github.g.user('repos').get():
                    if repo['name'] == name:
                        return True
                return False
            except github.ApiError:
                time.sleep(5)
            retry -= 1
>       raise Exception('error getting the list of repos')
E       Exception: error getting the list of repos

tests/fixture_github.py:68: Exception
---------------------------- Captured stderr setup -----------------------------
2017-02-08 14:47:39,105 INFO Starting new HTTP connection (1): localhost
2017-02-08 14:47:39,132 DEBUG "GET /users/current.json?limit=100&offset=0 HTTP/1.1" 200 None
2017-02-08 14:47:39,138 INFO Starting new HTTP connection (1): localhost
2017-02-08 14:47:39,170 DEBUG "GET /custom_fields.json?key=759d7669ffe84a3f430352b74a35a2469048b048&limit=100&offset=0 HTTP/1.1" 200 None
2017-02-08 14:47:39,175 INFO Starting new HTTP connection (1): localhost
2017-02-08 14:47:39,200 DEBUG "GET /projects.json?key=759d7669ffe84a3f430352b74a35a2469048b048&limit=100&offset=0 HTTP/1.1" 200 None
2017-02-08 14:47:39,205 INFO Starting new HTTP connection (1): localhost
2017-02-08 14:47:39,373 DEBUG "POST /projects.json?key=759d7669ffe84a3f430352b74a35a2469048b048 HTTP/1.1" 201 None
2017-02-08 14:47:39,378 INFO Starting new HTTP connection (1): localhost
2017-02-08 14:47:39,422 DEBUG "POST /projects/ceph/versions.json?key=759d7669ffe84a3f430352b74a35a2469048b048 HTTP/1.1" 201 None
2017-02-08 14:47:39,427 INFO Starting new HTTP connection (1): localhost
2017-02-08 14:47:39,571 DEBUG "POST /projects.json?key=759d7669ffe84a3f430352b74a35a2469048b048 HTTP/1.1" 201 None
2017-02-08 14:47:42,089 DEBUG :sh: 
        cd /tmp/tmpw7xhZG
        git init
        echo a >> master.txt ; git add master.txt ; git commit -m 'master' master.txt # noqa
        git branch cuttlefish
        echo a >> cuttlefish.txt ; git add cuttlefish.txt ; git commit -m 'cuttlefish' cuttlefish.txt # noqa
        git checkout master
        
2017-02-08 14:47:42,112 DEBUG Initialized empty Git repository in /tmp/tmpw7xhZG/.git/
2017-02-08 14:47:42,131 DEBUG [master (root-commit) 51017d5] master
2017-02-08 14:47:42,132 DEBUG Committer: GitLab Runner <gitlab-runner@workbench.ceph.com>
2017-02-08 14:47:42,133 DEBUG Your name and email address were configured automatically based
2017-02-08 14:47:42,134 DEBUG on your username and hostname. Please check that they are accurate.
2017-02-08 14:47:42,134 DEBUG You can suppress this message by setting them explicitly. Run the
2017-02-08 14:47:42,135 DEBUG following command and follow the instructions in your editor to edit
2017-02-08 14:47:42,135 DEBUG your configuration file:
2017-02-08 14:47:42,136 DEBUG 
2017-02-08 14:47:42,136 DEBUG git config --global --edit
2017-02-08 14:47:42,137 DEBUG 
2017-02-08 14:47:42,137 DEBUG After doing this, you may fix the identity used for this commit with:
2017-02-08 14:47:42,137 DEBUG 
2017-02-08 14:47:42,138 DEBUG git commit --amend --reset-author
2017-02-08 14:47:42,138 DEBUG 
2017-02-08 14:47:42,138 DEBUG 1 file changed, 1 insertion(+)
2017-02-08 14:47:42,138 DEBUG create mode 100644 master.txt
2017-02-08 14:47:42,156 DEBUG [master 763616c] cuttlefish
2017-02-08 14:47:42,156 DEBUG Committer: GitLab Runner <gitlab-runner@workbench.ceph.com>
2017-02-08 14:47:42,157 DEBUG Your name and email address were configured automatically based
2017-02-08 14:47:42,157 DEBUG on your username and hostname. Please check that they are accurate.
2017-02-08 14:47:42,157 DEBUG You can suppress this message by setting them explicitly. Run the
2017-02-08 14:47:42,157 DEBUG following command and follow the instructions in your editor to edit
2017-02-08 14:47:42,157 DEBUG your configuration file:
2017-02-08 14:47:42,158 DEBUG 
2017-02-08 14:47:42,158 DEBUG git config --global --edit
2017-02-08 14:47:42,158 DEBUG 
2017-02-08 14:47:42,158 DEBUG After doing this, you may fix the identity used for this commit with:
2017-02-08 14:47:42,158 DEBUG 
2017-02-08 14:47:42,159 DEBUG git commit --amend --reset-author
2017-02-08 14:47:42,159 DEBUG 
2017-02-08 14:47:42,159 DEBUG 1 file changed, 1 insertion(+)
2017-02-08 14:47:42,159 DEBUG create mode 100644 cuttlefish.txt
2017-02-08 14:47:42,162 DEBUG Already on 'master'
--------------------------- Captured stderr teardown ---------------------------
2017-02-08 14:47:42,178 INFO Starting new HTTP connection (1): localhost
2017-02-08 14:47:42,206 DEBUG "GET /projects.json?key=759d7669ffe84a3f430352b74a35a2469048b048&limit=100&offset=0 HTTP/1.1" 200 None
2017-02-08 14:47:42,210 INFO Starting new HTTP connection (1): localhost
2017-02-08 14:47:42,314 DEBUG "DELETE /projects/31.json?key=759d7669ffe84a3f430352b74a35a2469048b048 HTTP/1.1" 200 None
_________ ERROR at setup of TestWBBackportSetRelease.test_set_release __________

self = <test_wbbackportsetrelease.TestWBBackportSetRelease object at 0x7f2a7c6ad550>

    def setup(self):
        self.argv = []
        self.fixture_redmine = FixtureRedmine().setUp()
        self.argv += self.fixture_redmine.argv
>       self.fixture_github = FixtureGitHub().setUp()

tests/test_wbbackportsetrelease.py:40: 
_ _ _ _ _ _ _ _ _ _ _ _ _ _ _ _ _ _ _ _ _ _ _ _ _ _ _ _ _ _ _ _ _ _ _ _ _ _ _ _ 
tests/fixture_github.py:50: in setUp
    self.remove_project()
tests/fixture_github.py:79: in remove_project
    if self.project_exists(GITHUB['repo']):
_ _ _ _ _ _ _ _ _ _ _ _ _ _ _ _ _ _ _ _ _ _ _ _ _ _ _ _ _ _ _ _ _ _ _ _ _ _ _ _ 

self = <fixture_github.FixtureGitHub object at 0x7f2a7c6adad0>
name = 'testrepo-41c507bb4b853e35dccc'

    def project_exists(self, name):
        retry = 10
        while retry > 0:
            try:
                for repo in self.github.g.user('repos').get():
                    if repo['name'] == name:
                        return True
                return False
            except github.ApiError:
                time.sleep(5)
            retry -= 1
>       raise Exception('error getting the list of repos')
E       Exception: error getting the list of repos

tests/fixture_github.py:68: Exception
---------------------------- Captured stderr setup -----------------------------
2017-02-08 15:07:15,431 INFO Starting new HTTP connection (1): localhost
2017-02-08 15:07:15,471 DEBUG "GET /users/current.json?limit=100&offset=0 HTTP/1.1" 200 None
2017-02-08 15:07:15,477 INFO Starting new HTTP connection (1): localhost
2017-02-08 15:07:15,522 DEBUG "GET /custom_fields.json?key=759d7669ffe84a3f430352b74a35a2469048b048&limit=100&offset=0 HTTP/1.1" 200 None
2017-02-08 15:07:15,530 INFO Starting new HTTP connection (1): localhost
2017-02-08 15:07:15,558 DEBUG "GET /projects.json?key=759d7669ffe84a3f430352b74a35a2469048b048&limit=100&offset=0 HTTP/1.1" 200 None
2017-02-08 15:07:15,563 INFO Starting new HTTP connection (1): localhost
2017-02-08 15:07:15,720 DEBUG "POST /projects.json?key=759d7669ffe84a3f430352b74a35a2469048b048 HTTP/1.1" 201 None
2017-02-08 15:07:15,725 INFO Starting new HTTP connection (1): localhost
2017-02-08 15:07:15,784 DEBUG "POST /projects/ceph/versions.json?key=759d7669ffe84a3f430352b74a35a2469048b048 HTTP/1.1" 201 None
2017-02-08 15:07:15,789 INFO Starting new HTTP connection (1): localhost
2017-02-08 15:07:15,958 DEBUG "POST /projects.json?key=759d7669ffe84a3f430352b74a35a2469048b048 HTTP/1.1" 201 None
__________________ ERROR at setup of TestWBGitHub.test_index ___________________

cls = <class 'test_wbgithub.TestWBGitHub'>

    @classmethod
    def setUpClass(cls):
        cls.f = FixtureGitHub()
>       cls.f.setUp()

tests/test_wbgithub.py:35: 
_ _ _ _ _ _ _ _ _ _ _ _ _ _ _ _ _ _ _ _ _ _ _ _ _ _ _ _ _ _ _ _ _ _ _ _ _ _ _ _ 
tests/fixture_github.py:50: in setUp
    self.remove_project()
tests/fixture_github.py:79: in remove_project
    if self.project_exists(GITHUB['repo']):
_ _ _ _ _ _ _ _ _ _ _ _ _ _ _ _ _ _ _ _ _ _ _ _ _ _ _ _ _ _ _ _ _ _ _ _ _ _ _ _ 

self = <fixture_github.FixtureGitHub object at 0x7f2a7c5fdd50>
name = 'testrepo-41c507bb4b853e35dccc'

    def project_exists(self, name):
        retry = 10
        while retry > 0:
            try:
                for repo in self.github.g.user('repos').get():
                    if repo['name'] == name:
                        return True
                return False
            except github.ApiError:
                time.sleep(5)
            retry -= 1
>       raise Exception('error getting the list of repos')
E       Exception: error getting the list of repos

tests/fixture_github.py:68: Exception
_______________ ERROR at setup of TestWBGitHub.test_pull_request _______________

cls = <class 'test_wbgithub.TestWBGitHub'>

    @classmethod
    def setUpClass(cls):
        cls.f = FixtureGitHub()
>       cls.f.setUp()

tests/test_wbgithub.py:35: 
_ _ _ _ _ _ _ _ _ _ _ _ _ _ _ _ _ _ _ _ _ _ _ _ _ _ _ _ _ _ _ _ _ _ _ _ _ _ _ _ 
tests/fixture_github.py:50: in setUp
    self.remove_project()
tests/fixture_github.py:79: in remove_project
    if self.project_exists(GITHUB['repo']):
_ _ _ _ _ _ _ _ _ _ _ _ _ _ _ _ _ _ _ _ _ _ _ _ _ _ _ _ _ _ _ _ _ _ _ _ _ _ _ _ 

self = <fixture_github.FixtureGitHub object at 0x7f2a7c5fdd50>
name = 'testrepo-41c507bb4b853e35dccc'

    def project_exists(self, name):
        retry = 10
        while retry > 0:
            try:
                for repo in self.github.g.user('repos').get():
                    if repo['name'] == name:
                        return True
                return False
            except github.ApiError:
                time.sleep(5)
            retry -= 1
>       raise Exception('error getting the list of repos')
E       Exception: error getting the list of repos

tests/fixture_github.py:68: Exception
=========== 37 passed, 1 pytest-warnings, 8 error in 2017.62 seconds ===========
ERROR: InvocationError: '/usr/bin/env PATH=/home/gitlab-runner/builds/9120dac4/0/root/ceph-workbench/teuthology/virtualenv/bin:/home/gitlab-runner/builds/9120dac4/0/root/ceph-workbench/virtualenv/bin:/usr/local/bin:/usr/bin:/bin:/usr/local/games:/usr/games /home/gitlab-runner/builds/9120dac4/0/root/ceph-workbench/.tox/py3/bin/coverage run --source=ceph_workbench /home/gitlab-runner/builds/9120dac4/0/root/ceph-workbench/.tox/py3/bin/py.test -v tests'
___________________________________ summary ____________________________________
  flake8: commands succeeded
ERROR:   py27: commands failed
ERROR:   py3: commands failed
+ bash tests/teardown.sh
test-gitlab
test-gitlab
test-mysql
test-mysql
test-redis
test-redis
postgresql-redmine
postgresql-redmine
redmine
redmine

ERROR: Build failed with: exit status 1

Build #509

Duration: 61 minutes 36 seconds

Created:

Finished:

Runner: #1

Commit

Branch: wip-suse-master

Author: Nathan Cutler

Message: teuthology: update to latest wip-buildpackages-2 Signed-off-by: Nathan Cutler <ncutler@suse.com>